BDBM50024229 CHEMBL3325538
SMILES: FCCN1CC[C@H]([C@H](COc2cc(F)c(cc2F)S(=O)(=O)Nc2ncns2)C1)c1ccc(Cl)cc1
InChI Key: InChIKey=LXZJEDQMTJCHFZ-RDJZCZTQSA-N
Data: 2 IC50
Activity Spreadsheet -- Enzyme Inhibition Constant Data from BindingDB
Found 2 hits for monomerid = 50024229
Trg + Lig
Ki
nM
ΔG°
kcal/mole
IC50
nM
Kd
nM
EC50/IC50
nM
koff
s-1
kon
M-1s-1
pHTemp
°C
Sodium channel protein type 5 subunit alpha
(Homo sapiens (Human))
BDBM50024229
(CHEMBL3325538)
Show SMILES FCCN1CC[C@H]([C@H](COc2cc(F)c(cc2F)S(=O)(=O)Nc2ncns2)C1)c1ccc(Cl)cc1 |r|
Show InChI InChI=1S/C22H22ClF3N4O3S2/c23-16-3-1-14(2-4-16)17-5-7-30(8-6-24)11-15(17)12-33-20-9-19(26)21(10-18(20)25)35(31,32)29-22-27-13-28-34-22/h1-4,9-10,13,15,17H,5-8,11-12H2,(H,27,28,29)/t15-,17-/m0/s1
n/an/a>1.00E+4n/an/an/an/an/an/a
Xenon Pharmaceuticals Inc.
Curated by ChEMBL
Assay Description
Inhibition of human Nav1.5 expressed in HEK cells assessed as reduction in sodium current at -60 mV holding potential by PatchXpress platform based w...
Bioorg Med Chem Lett 24: 4397-401 (2014)
Article DOI: 10.1016/j.bmcl.2014.08.017
BindingDB Entry DOI: 10.7270/Q2FF3TX9
Sodium channel protein type 9 subunit alpha
(Homo sapiens (Human))
BDBM50024229
(CHEMBL3325538)
Show SMILES FCCN1CC[C@H]([C@H](COc2cc(F)c(cc2F)S(=O)(=O)Nc2ncns2)C1)c1ccc(Cl)cc1 |r|
Show InChI InChI=1S/C22H22ClF3N4O3S2/c23-16-3-1-14(2-4-16)17-5-7-30(8-6-24)11-15(17)12-33-20-9-19(26)21(10-18(20)25)35(31,32)29-22-27-13-28-34-22/h1-4,9-10,13,15,17H,5-8,11-12H2,(H,27,28,29)/t15-,17-/m0/s1
n/an/a 7n/an/an/an/an/an/a
Xenon Pharmaceuticals Inc.
Curated by ChEMBL
Assay Description
Inhibition of human Nav1.7 expressed in HEK cells assessed as reduction in sodium current at -60 mV holding potential by PatchXpress platform based w...
Bioorg Med Chem Lett 24: 4397-401 (2014)
Article DOI: 10.1016/j.bmcl.2014.08.017
BindingDB Entry DOI: 10.7270/Q2FF3TX9