BDBM50024273 CHEMBL2112040
SMILES: CC[C@H](C)OCc1ccc2n(CCCO)c3c4Cc5ccccc5-c4c4C(=O)NCc4c3c2c1
InChI Key: InChIKey=PHSZEFBOTLZUMM-KRWDZBQOSA-N
Data: 1 IC50
Activity Spreadsheet -- Enzyme Inhibition Constant Data from BindingDB
Found 1 hit for monomerid = 50024273
Trg + Lig
Ki
nM
ΔG°
kcal/mole
IC50
nM
Kd
nM
EC50/IC50
nM
koff
s-1
kon
M-1s-1
pHTemp
°C
Vascular endothelial growth factor receptor 2
(Homo sapiens (Human))
BDBM50024273
(CHEMBL2112040)
Show SMILES CC[C@H](C)OCc1ccc2n(CCCO)c3c4Cc5ccccc5-c4c4C(=O)NCc4c3c2c1 |r|
Show InChI InChI=1S/C29H30N2O3/c1-3-17(2)34-16-18-9-10-24-21(13-18)26-23-15-30-29(33)27(23)25-20-8-5-4-7-19(20)14-22(25)28(26)31(24)11-6-12-32/h4-5,7-10,13,17,32H,3,6,11-12,14-16H2,1-2H3,(H,30,33)/t17-/m0/s1
NCI pathway
Reactome pathway
n/an/a 19n/an/an/an/an/an/a
Cephalon, Inc
Curated by ChEMBL
Assay Description
In vitro inhibitory concentration against human vascular endothelial growth factor receptor 2
J Med Chem 46: 5375-88 (2003)
Article DOI: 10.1021/jm0301641
BindingDB Entry DOI: 10.7270/Q2V69J1X