BDBM50024795 CHEMBL2096892
SMILES: COc1ccc2cc(ccc2c1)-c1nc([nH]c1-c1ccncc1)-c1ccc(cc1C)[S@@+](C)[O-]
InChI Key:
Data: 1 IC50
Activity Spreadsheet -- Enzyme Inhibition Constant Data from BindingDB
Found 1 hit for monomerid = 50024795
Trg + Lig
Ki
nM
ΔG°
kcal/mole
IC50
nM
Kd
nM
EC50/IC50
nM
koff
s-1
kon
M-1s-1
pHTemp
°C
Angiopoietin-1 receptor
(Homo sapiens (Human))
BDBM50024795
(CHEMBL2096892)
Show SMILES COc1ccc2cc(ccc2c1)-c1nc([nH]c1-c1ccncc1)-c1ccc(cc1C)[S@@+](C)[O-] |r|
n/an/a 22n/an/an/an/an/an/a
GlaxoSmithKline
Curated by ChEMBL
Assay Description
Inhibition of Tie2
Bioorg Med Chem Lett 17: 5514-7 (2007)
Article DOI: 10.1016/j.bmcl.2007.08.052
BindingDB Entry DOI: 10.7270/Q2542N96