BDBM50024857 CHEMBL3337830
SMILES: Cc1nn(CC(F)(F)CCO)c(c1-c1ccc2OCC(=O)Nc2c1)-c1ccc(F)cc1
InChI Key: InChIKey=PEKALRYAPXRXBV-UHFFFAOYSA-N
Data: 5 IC50
Activity Spreadsheet -- Enzyme Inhibition Constant Data from BindingDB
Found 5 hits for monomerid = 50024857
Trg + Lig
Ki
nM
ΔG°
kcal/mole
IC50
nM
Kd
nM
EC50/IC50
nM
koff
s-1
kon
M-1s-1
pHTemp
°C
Mineralocorticoid receptor
(Homo sapiens (Human))
BDBM50024857
(CHEMBL3337830)
Show SMILES Cc1nn(CC(F)(F)CCO)c(c1-c1ccc2OCC(=O)Nc2c1)-c1ccc(F)cc1
Show InChI InChI=1S/C22H20F3N3O3/c1-13-20(15-4-7-18-17(10-15)26-19(30)11-31-18)21(14-2-5-16(23)6-3-14)28(27-13)12-22(24,25)8-9-29/h2-7,10,29H,8-9,11-12H2,1H3,(H,26,30)
n/an/a 38n/an/an/an/an/an/a
Takeda Pharmaceutical Company Limited
Curated by ChEMBL
Assay Description
Displacement of [3H]aldosterone from human mineralocorticoid receptor expressed in 293 cells after 16 hrs by scintillation counting
Bioorg Med Chem 22: 5428-45 (2014)
Article DOI: 10.1016/j.bmc.2014.07.038
BindingDB Entry DOI: 10.7270/Q218383G
Progesterone receptor
(Homo sapiens (Human))
BDBM50024857
(CHEMBL3337830)
Show SMILES Cc1nn(CC(F)(F)CCO)c(c1-c1ccc2OCC(=O)Nc2c1)-c1ccc(F)cc1
Show InChI InChI=1S/C22H20F3N3O3/c1-13-20(15-4-7-18-17(10-15)26-19(30)11-31-18)21(14-2-5-16(23)6-3-14)28(27-13)12-22(24,25)8-9-29/h2-7,10,29H,8-9,11-12H2,1H3,(H,26,30)
n/an/a 1.30E+3n/an/an/an/an/an/a
Takeda Pharmaceutical Company Limited
Curated by ChEMBL
Assay Description
Displacement of [3H]-Dexamethasone from glucocorticoid receptor (unknown origin) expressed in 293 cells after 16 hrs by scintillation counting
Bioorg Med Chem 22: 5428-45 (2014)
Article DOI: 10.1016/j.bmc.2014.07.038
BindingDB Entry DOI: 10.7270/Q218383G
Progesterone receptor
(Homo sapiens (Human))
BDBM50024857
(CHEMBL3337830)
Show SMILES Cc1nn(CC(F)(F)CCO)c(c1-c1ccc2OCC(=O)Nc2c1)-c1ccc(F)cc1
Show InChI InChI=1S/C22H20F3N3O3/c1-13-20(15-4-7-18-17(10-15)26-19(30)11-31-18)21(14-2-5-16(23)6-3-14)28(27-13)12-22(24,25)8-9-29/h2-7,10,29H,8-9,11-12H2,1H3,(H,26,30)
n/an/a>1.00E+4n/an/an/an/an/an/a
Takeda Pharmaceutical Company Limited
Curated by ChEMBL
Assay Description
Displacement of [[3H]-Progesterone from progesterone receptor (unknown origin) expressed in 293 cells after 16 hrs by scintillation counting
Bioorg Med Chem 22: 5428-45 (2014)
Article DOI: 10.1016/j.bmc.2014.07.038
BindingDB Entry DOI: 10.7270/Q218383G
Androgen Receptor
(Homo sapiens (Human))
BDBM50024857
(CHEMBL3337830)
Show SMILES Cc1nn(CC(F)(F)CCO)c(c1-c1ccc2OCC(=O)Nc2c1)-c1ccc(F)cc1
Show InChI InChI=1S/C22H20F3N3O3/c1-13-20(15-4-7-18-17(10-15)26-19(30)11-31-18)21(14-2-5-16(23)6-3-14)28(27-13)12-22(24,25)8-9-29/h2-7,10,29H,8-9,11-12H2,1H3,(H,26,30)
NCI pathway
Reactome pathway
n/an/a>1.00E+4n/an/an/an/an/an/a
Takeda Pharmaceutical Company Limited
Curated by ChEMBL
Assay Description
Displacement of [3H]testosterone from androgen receptor (unknown origin) expressed in 293 cells after 16 hrs by scintillation counting
Bioorg Med Chem 22: 5428-45 (2014)
Article DOI: 10.1016/j.bmc.2014.07.038
BindingDB Entry DOI: 10.7270/Q218383G
Mineralocorticoid receptor
(Homo sapiens (Human))
BDBM50024857
(CHEMBL3337830)
Show SMILES Cc1nn(CC(F)(F)CCO)c(c1-c1ccc2OCC(=O)Nc2c1)-c1ccc(F)cc1
Show InChI InChI=1S/C22H20F3N3O3/c1-13-20(15-4-7-18-17(10-15)26-19(30)11-31-18)21(14-2-5-16(23)6-3-14)28(27-13)12-22(24,25)8-9-29/h2-7,10,29H,8-9,11-12H2,1H3,(H,26,30)
n/an/a 540n/an/an/an/an/an/a
Takeda Pharmaceutical Company Limited
Curated by ChEMBL
Assay Description
Antagonist activity at human mineralocorticoid receptor expressed in COS1 cells after 1 day by luciferase reporter gene assay
Bioorg Med Chem 22: 5428-45 (2014)
Article DOI: 10.1016/j.bmc.2014.07.038
BindingDB Entry DOI: 10.7270/Q218383G