null
SMILES: CN(CCCOc1ccc2c(c1)oc(=O)c1ccccc21)Cc1ccccc1
InChI Key: InChIKey=VWMVVTZSFRCBOF-UHFFFAOYSA-N
Activity Spreadsheet -- Enzyme Inhibition Constant Data from BindingDB
Found 2 hits for monomerid = 50024879
Trg + Lig
Ki
nM
ΔG°
kcal/mole
IC50
nM
Kd
nM
EC50/IC50
nM
koff
s-1
kon
M-1s-1
pHTemp
°C
Acetylcholinesterase
(Homo sapiens (Human))
BDBM50024879
(CHEMBL3335062)
Show SMILES CN(CCCOc1ccc2c(c1)oc(=O)c1ccccc21)Cc1ccccc1
Show InChI InChI=1S/C24H23NO3/c1-25(17-18-8-3-2-4-9-18)14-7-15-27-19-12-13-21-20-10-5-6-11-22(20)24(26)28-23(21)16-19/h2-6,8-13,16H,7,14-15,17H2,1H3
NCI pathway
Reactome pathway
n/an/a 8.50E+3n/an/an/an/an/an/a
Eastern Mediterranean University
Curated by ChEMBL
Assay Description
Inhibition of human recombinant AChE using acetylthiocholine iodide substrate incubated for 15 mins by spectrophotometry based Ellman's method
Bioorg Med Chem 22: 5141-54 (2014)
Article DOI: 10.1016/j.bmc.2014.08.016
BindingDB Entry DOI: 10.7270/Q2WH2RKB
Cholinesterase
(Homo sapiens (Human))
BDBM50024879
(CHEMBL3335062)
Show SMILES CN(CCCOc1ccc2c(c1)oc(=O)c1ccccc21)Cc1ccccc1
Show InChI InChI=1S/C24H23NO3/c1-25(17-18-8-3-2-4-9-18)14-7-15-27-19-12-13-21-20-10-5-6-11-22(20)24(26)28-23(21)16-19/h2-6,8-13,16H,7,14-15,17H2,1H3
Reactome pathway
n/an/a 1.49E+4n/an/an/an/an/an/a
Eastern Mediterranean University
Curated by ChEMBL
Assay Description
Inhibition of human recombinant BuChE using butyrylthiocholine iodide substrate incubated for 15 mins by spectrophotometry based Ellman's method
Bioorg Med Chem 22: 5141-54 (2014)
Article DOI: 10.1016/j.bmc.2014.08.016
BindingDB Entry DOI: 10.7270/Q2WH2RKB