null
SMILES: COc1cccc(CN(C)CCOc2ccc3c4CCCCc4c(=O)oc3c2)c1
InChI Key: InChIKey=GUPUZWRGJITBCC-UHFFFAOYSA-N
Activity Spreadsheet -- Enzyme Inhibition Constant Data from BindingDB
Found 2 hits for monomerid = 50024933
Trg + Lig
Ki
nM
ΔG°
kcal/mole
IC50
nM
Kd
nM
EC50/IC50
nM
koff
s-1
kon
M-1s-1
pHTemp
°C
Cholinesterase
(Homo sapiens (Human))
BDBM50024933
(CHEMBL3335026)
Show SMILES COc1cccc(CN(C)CCOc2ccc3c4CCCCc4c(=O)oc3c2)c1
Show InChI InChI=1S/C24H27NO4/c1-25(16-17-6-5-7-18(14-17)27-2)12-13-28-19-10-11-21-20-8-3-4-9-22(20)24(26)29-23(21)15-19/h5-7,10-11,14-15H,3-4,8-9,12-13,16H2,1-2H3
Reactome pathway
n/an/a>4.00E+4n/an/an/an/an/an/a
Eastern Mediterranean University
Curated by ChEMBL
Assay Description
Inhibition of human recombinant BuChE using butyrylthiocholine iodide substrate incubated for 15 mins by spectrophotometry based Ellman's method
Bioorg Med Chem 22: 5141-54 (2014)
Article DOI: 10.1016/j.bmc.2014.08.016
BindingDB Entry DOI: 10.7270/Q2WH2RKB
Acetylcholinesterase
(Homo sapiens (Human))
BDBM50024933
(CHEMBL3335026)
Show SMILES COc1cccc(CN(C)CCOc2ccc3c4CCCCc4c(=O)oc3c2)c1
Show InChI InChI=1S/C24H27NO4/c1-25(16-17-6-5-7-18(14-17)27-2)12-13-28-19-10-11-21-20-8-3-4-9-22(20)24(26)29-23(21)15-19/h5-7,10-11,14-15H,3-4,8-9,12-13,16H2,1-2H3
NCI pathway
Reactome pathway
n/an/a 6.00E+3n/an/an/an/an/an/a
Eastern Mediterranean University
Curated by ChEMBL
Assay Description
Inhibition of human recombinant AChE using acetylthiocholine iodide substrate incubated for 15 mins by spectrophotometry based Ellman's method
Bioorg Med Chem 22: 5141-54 (2014)
Article DOI: 10.1016/j.bmc.2014.08.016
BindingDB Entry DOI: 10.7270/Q2WH2RKB