BDBM50025179 CHEMBL3337887
SMILES: COc1cccc(CNC(=O)c2nc3scc(COCc4ccccc4)c3c(=O)[nH]2)c1
InChI Key: InChIKey=JSYCWYGCWPUYSY-UHFFFAOYSA-N
Data: 1 IC50
Activity Spreadsheet -- Enzyme Inhibition Constant Data from BindingDB
Found 1 hit for monomerid = 50025179
Trg + Lig
Ki
nM
ΔG°
kcal/mole
IC50
nM
Kd
nM
EC50/IC50
nM
koff
s-1
kon
M-1s-1
pHTemp
°C
Collagenase 3
(Homo sapiens (Human))
BDBM50025179
(CHEMBL3337887)
Show SMILES COc1cccc(CNC(=O)c2nc3scc(COCc4ccccc4)c3c(=O)[nH]2)c1
Show InChI InChI=1S/C23H21N3O4S/c1-29-18-9-5-8-16(10-18)11-24-22(28)20-25-21(27)19-17(14-31-23(19)26-20)13-30-12-15-6-3-2-4-7-15/h2-10,14H,11-13H2,1H3,(H,24,28)(H,25,26,27)
NCI pathway
Reactome pathway
n/an/a 0.190n/an/an/an/an/an/a
Takeda Pharmaceutical Company Ltd
Curated by ChEMBL
Assay Description
Inhibition of human recombinant MMP13 catalytic domain using fluorescence peptide Cy3-PLGLK(Cy5Q)AR-NH2 substrate by fluorescence assay
Bioorg Med Chem 22: 5487-505 (2014)
Article DOI: 10.1016/j.bmc.2014.07.025
BindingDB Entry DOI: 10.7270/Q27S7QBJ