BDBM50025236 2-{4-[(2-Amino-4-hydroxy-quinazolin-6-ylmethyl)-formyl-amino]-benzoylamino}-pentanedioic acid::2-{4-[(2-Amino-4-oxo-3,4-dihydro-quinazolin-6-ylmethyl)-formyl-amino]-benzoylamino}-pentanedioic acid::CHEMBL140448
SMILES: Nc1nc2ccc(CN(C=O)c3ccc(cc3)C(=O)NC(CCC(O)=O)C(O)=O)cc2c(=O)[nH]1
InChI Key: InChIKey=QHUBQNFYSLRYQG-UHFFFAOYSA-N
Data: 1 KI  2 IC50
Activity Spreadsheet -- Enzyme Inhibition Constant Data from BindingDB
Found 3 hits for monomerid = 50025236
Trg + Lig
Ki
nM
ΔG°
kcal/mole
IC50
nM
Kd
nM
EC50/IC50
nM
koff
s-1
kon
M-1s-1
pHTemp
°C
Glycinamide ribonucleotide formyltransferase (GARFTase)
(Homo sapiens (Human))
BDBM50025236
(2-{4-[(2-Amino-4-hydroxy-quinazolin-6-ylmethyl)-fo...)
Show SMILES Nc1nc2ccc(CN(C=O)c3ccc(cc3)C(=O)NC(CCC(O)=O)C(O)=O)cc2c(=O)[nH]1
Show InChI InChI=1S/C22H21N5O7/c23-22-25-16-6-1-12(9-15(16)20(32)26-22)10-27(11-28)14-4-2-13(3-5-14)19(31)24-17(21(33)34)7-8-18(29)30/h1-6,9,11,17H,7-8,10H2,(H,24,31)(H,29,30)(H,33,34)(H3,23,25,26,32)
4.00E+3n/an/an/an/an/an/an/an/a
TBA
Curated by ChEMBL
Assay Description
Compound was evaluated for the inhibition of GAR transformylase isolated from murine lymphoma cell line L5178Y
J Med Chem 29: 2117-9 (1986)
BindingDB Entry DOI: 10.7270/Q20G3J5F
Dihydrofolate reductase
(Homo sapiens (Human))
BDBM50025236
(2-{4-[(2-Amino-4-hydroxy-quinazolin-6-ylmethyl)-fo...)
Show SMILES Nc1nc2ccc(CN(C=O)c3ccc(cc3)C(=O)NC(CCC(O)=O)C(O)=O)cc2c(=O)[nH]1
Show InChI InChI=1S/C22H21N5O7/c23-22-25-16-6-1-12(9-15(16)20(32)26-22)10-27(11-28)14-4-2-13(3-5-14)19(31)24-17(21(33)34)7-8-18(29)30/h1-6,9,11,17H,7-8,10H2,(H,24,31)(H,29,30)(H,33,34)(H3,23,25,26,32)
NCI pathway
Reactome pathway
n/an/a 11n/an/an/an/an/an/a
Medical University of South Carolina
Curated by ChEMBL
Assay Description
Inhibitory activity against dihydrofolate reductase (DHFR) obtained from human WIL2 cells
J Med Chem 31: 449-54 (1988)
BindingDB Entry DOI: 10.7270/Q2DF6SD0
Thymidylate synthase
(Mus musculus)
BDBM50025236
(2-{4-[(2-Amino-4-hydroxy-quinazolin-6-ylmethyl)-fo...)
Show SMILES Nc1nc2ccc(CN(C=O)c3ccc(cc3)C(=O)NC(CCC(O)=O)C(O)=O)cc2c(=O)[nH]1
Show InChI InChI=1S/C22H21N5O7/c23-22-25-16-6-1-12(9-15(16)20(32)26-22)10-27(11-28)14-4-2-13(3-5-14)19(31)24-17(21(33)34)7-8-18(29)30/h1-6,9,11,17H,7-8,10H2,(H,24,31)(H,29,30)(H,33,34)(H3,23,25,26,32)
Reactome pathway
n/an/a 9.80E+3n/an/an/an/an/an/a
Medical University of South Carolina
Curated by ChEMBL
Assay Description
Inhibitory activity against thymidylate synthase isolated from L1210 leukemia cells
J Med Chem 31: 449-54 (1988)
BindingDB Entry DOI: 10.7270/Q2DF6SD0