null
SMILES: [H][C@@]12CC[C@@]3(C)[C@@H](C[C@H](OC(=O)\C=C\c4ccsc4)C(=O)[C@]3([H])[C@@]1(C)C[C@H](OC2=O)c1ccoc1)C(=O)OC
InChI Key: InChIKey=HFQQZBGZKPQOGE-RRXSBXBLSA-N
Activity Spreadsheet -- Enzyme Inhibition Constant Data from BindingDB
Found 4 hits for monomerid = 50025277
Trg + Lig
Ki
nM
ΔG°
kcal/mole
IC50
nM
Kd
nM
EC50/IC50
nM
koff
s-1
kon
M-1s-1
pHTemp
°C
Mu-type opioid receptor
(Homo sapiens (Human))
BDBM50025277
(CHEMBL3330683)
Show SMILES [H][C@@]12CC[C@@]3(C)[C@@H](C[C@H](OC(=O)\C=C\c4ccsc4)C(=O)[C@]3([H])[C@@]1(C)C[C@H](OC2=O)c1ccoc1)C(=O)OC |r|
Show InChI InChI=1S/C28H30O8S/c1-27-9-6-18-26(32)36-21(17-7-10-34-14-17)13-28(18,2)24(27)23(30)20(12-19(27)25(31)33-3)35-22(29)5-4-16-8-11-37-15-16/h4-5,7-8,10-11,14-15,18-21,24H,6,9,12-13H2,1-3H3/b5-4+/t18-,19-,20-,21-,24-,27-,28-/m0/s1
NCI pathway
Reactome pathway
18n/an/an/an/an/an/an/an/a
University of Mississippi
Curated by ChEMBL
Assay Description
Displacement of [3H]DAMGO from mu opioid receptor (unknown origin) expressed in HEK293T cells after 1.5 hrs by radioligand binding assay
Eur J Med Chem 85: 818-29 (2014)
Article DOI: 10.1016/j.ejmech.2014.07.077
BindingDB Entry DOI: 10.7270/Q2VH5QDH
Delta-type opioid receptor
(Homo sapiens (Human))
BDBM50025277
(CHEMBL3330683)
Show SMILES [H][C@@]12CC[C@@]3(C)[C@@H](C[C@H](OC(=O)\C=C\c4ccsc4)C(=O)[C@]3([H])[C@@]1(C)C[C@H](OC2=O)c1ccoc1)C(=O)OC |r|
Show InChI InChI=1S/C28H30O8S/c1-27-9-6-18-26(32)36-21(17-7-10-34-14-17)13-28(18,2)24(27)23(30)20(12-19(27)25(31)33-3)35-22(29)5-4-16-8-11-37-15-16/h4-5,7-8,10-11,14-15,18-21,24H,6,9,12-13H2,1-3H3/b5-4+/t18-,19-,20-,21-,24-,27-,28-/m0/s1
Reactome pathway
228n/an/an/an/an/an/an/an/a
University of Mississippi
Curated by ChEMBL
Assay Description
Displacement of [3H]DADLE from delta opioid receptor (unknown origin) expressed in HEK293T cells after 1.5 hrs by radioligand binding assay
Eur J Med Chem 85: 818-29 (2014)
Article DOI: 10.1016/j.ejmech.2014.07.077
BindingDB Entry DOI: 10.7270/Q2VH5QDH
Kappa-type opioid receptor
(Homo sapiens (Human))
BDBM50025277
(CHEMBL3330683)
Show SMILES [H][C@@]12CC[C@@]3(C)[C@@H](C[C@H](OC(=O)\C=C\c4ccsc4)C(=O)[C@]3([H])[C@@]1(C)C[C@H](OC2=O)c1ccoc1)C(=O)OC |r|
Show InChI InChI=1S/C28H30O8S/c1-27-9-6-18-26(32)36-21(17-7-10-34-14-17)13-28(18,2)24(27)23(30)20(12-19(27)25(31)33-3)35-22(29)5-4-16-8-11-37-15-16/h4-5,7-8,10-11,14-15,18-21,24H,6,9,12-13H2,1-3H3/b5-4+/t18-,19-,20-,21-,24-,27-,28-/m0/s1
Reactome pathway
304n/an/an/an/an/an/an/an/a
University of Mississippi
Curated by ChEMBL
Assay Description
Displacement of [3H]U69593 from kappa opioid receptor (unknown origin) expressed in HEK293T cells after 1.5 hrs by radioligand binding assay
Eur J Med Chem 85: 818-29 (2014)
Article DOI: 10.1016/j.ejmech.2014.07.077
BindingDB Entry DOI: 10.7270/Q2VH5QDH
Kappa-type opioid receptor
(Homo sapiens (Human))
BDBM50025277
(CHEMBL3330683)
Show SMILES [H][C@@]12CC[C@@]3(C)[C@@H](C[C@H](OC(=O)\C=C\c4ccsc4)C(=O)[C@]3([H])[C@@]1(C)C[C@H](OC2=O)c1ccoc1)C(=O)OC |r|
Show InChI InChI=1S/C28H30O8S/c1-27-9-6-18-26(32)36-21(17-7-10-34-14-17)13-28(18,2)24(27)23(30)20(12-19(27)25(31)33-3)35-22(29)5-4-16-8-11-37-15-16/h4-5,7-8,10-11,14-15,18-21,24H,6,9,12-13H2,1-3H3/b5-4+/t18-,19-,20-,21-,24-,27-,28-/m0/s1
Reactome pathway
n/an/an/an/a 582n/an/an/an/a
University of Mississippi
Curated by ChEMBL
Assay Description
Inhibition of human kappa opioid receptor expressed in HEK293T cells assessed as inhibition of cAMP production after 30 mins
Eur J Med Chem 85: 818-29 (2014)
Article DOI: 10.1016/j.ejmech.2014.07.077
BindingDB Entry DOI: 10.7270/Q2VH5QDH