BDBM50025847 CHEMBL3330879
SMILES: COc1cc(NC(=O)CO[C@H]2O[C@H](CO)[C@@H](O)[C@H](O)[C@H]2O)c(Cl)cc1C(=O)NCCc1ccc(cc1)S(=O)(=O)NC(=O)NC1CCCCC1
InChI Key: InChIKey=BXLGBPMIMHMNHB-JGALVPIPSA-N
Data: 1 Kd
Activity Spreadsheet -- Enzyme Inhibition Constant Data from BindingDB
Found 1 hit for monomerid = 50025847
Trg + Lig
Ki
nM
ΔG°
kcal/mole
IC50
nM
Kd
nM
EC50/IC50
nM
koff
s-1
kon
M-1s-1
pHTemp
°C
Sulfonylurea receptor 1
(Homo sapiens (Human))
BDBM50025847
(CHEMBL3330879)
Show SMILES COc1cc(NC(=O)CO[C@H]2O[C@H](CO)[C@@H](O)[C@H](O)[C@H]2O)c(Cl)cc1C(=O)NCCc1ccc(cc1)S(=O)(=O)NC(=O)NC1CCCCC1 |r|
Show InChI InChI=1S/C31H41ClN4O12S/c1-46-23-14-22(35-25(38)16-47-30-28(41)27(40)26(39)24(15-37)48-30)21(32)13-20(23)29(42)33-12-11-17-7-9-19(10-8-17)49(44,45)36-31(43)34-18-5-3-2-4-6-18/h7-10,13-14,18,24,26-28,30,37,39-41H,2-6,11-12,15-16H2,1H3,(H,33,42)(H,35,38)(H2,34,36,43)/t24-,26-,27+,28-,30+/m1/s1
NCI pathway
Reactome pathway
n/an/an/a 2.10n/an/an/an/an/a
Universidade Federal de Santa Catarina
Curated by ChEMBL
Assay Description
Binding affinity to SUR1 (unknown origin)
Eur J Med Chem 86: 491-501 (2014)
Article DOI: 10.1016/j.ejmech.2014.09.007
BindingDB Entry DOI: 10.7270/Q2319XGR