BDBM50025944 3-Hydroxy-4-[3-(1H-imidazol-4-yl)-2-(2-phenoxy-acetylamino)-propionylamino]-5-phenyl-pentanoic acid [1-(1-carbamoyl-2-phenyl-ethylcarbamoyl)-3-methyl-butyl]-amide::CHEMBL3144409::CHEMBL48716
SMILES: CC(C)C[C@H](NC(=O)C[C@H](O)[C@H](Cc1ccccc1)NC(=O)[C@H](Cc1c[nH]cn1)NC(=O)COc1ccccc1)C(=O)N[C@@H](Cc1ccccc1)C(N)=O
InChI Key: InChIKey=GPRUYLDATGQOHQ-UHFFFAOYSA-N
Data: 1 KI  2 IC50
Activity Spreadsheet -- Enzyme Inhibition Constant Data from BindingDB
Found 3 hits for monomerid = 50025944
Trg + Lig
Ki
nM
ΔG°
kcal/mole
IC50
nM
Kd
nM
EC50/IC50
nM
koff
s-1
kon
M-1s-1
pHTemp
°C
Renin
(Homo sapiens (Human))
BDBM50025944
(3-Hydroxy-4-[3-(1H-imidazol-4-yl)-2-(2-phenoxy-ace...)
Show SMILES CC(C)C[C@H](NC(=O)C[C@H](O)[C@H](Cc1ccccc1)NC(=O)[C@H](Cc1c[nH]cn1)NC(=O)COc1ccccc1)C(=O)N[C@@H](Cc1ccccc1)C(N)=O |r|
Show InChI InChI=1S/C40H49N7O7/c1-26(2)18-33(39(52)47-32(38(41)51)20-28-14-8-4-9-15-28)44-36(49)22-35(48)31(19-27-12-6-3-7-13-27)46-40(53)34(21-29-23-42-25-43-29)45-37(50)24-54-30-16-10-5-11-17-30/h3-17,23,25-26,31-35,48H,18-22,24H2,1-2H3,(H2,41,51)(H,42,43)(H,44,49)(H,45,50)(H,46,53)(H,47,52)
Reactome pathway
580n/an/an/an/an/an/an/an/a
TBA
Curated by ChEMBL
Assay Description
Inhibition of human kidney renin
J Med Chem 28: 1779-90 (1986)
BindingDB Entry DOI: 10.7270/Q2FJ2HC2
Renin
(Homo sapiens (Human))
BDBM50025944
(3-Hydroxy-4-[3-(1H-imidazol-4-yl)-2-(2-phenoxy-ace...)
Show SMILES CC(C)C[C@H](NC(=O)C[C@H](O)[C@H](Cc1ccccc1)NC(=O)[C@H](Cc1c[nH]cn1)NC(=O)COc1ccccc1)C(=O)N[C@@H](Cc1ccccc1)C(N)=O |r|
Show InChI InChI=1S/C40H49N7O7/c1-26(2)18-33(39(52)47-32(38(41)51)20-28-14-8-4-9-15-28)44-36(49)22-35(48)31(19-27-12-6-3-7-13-27)46-40(53)34(21-29-23-42-25-43-29)45-37(50)24-54-30-16-10-5-11-17-30/h3-17,23,25-26,31-35,48H,18-22,24H2,1-2H3,(H2,41,51)(H,42,43)(H,44,49)(H,45,50)(H,46,53)(H,47,52)
Reactome pathway
n/an/a>1.00E+3n/an/an/an/an/an/a
TBA
Curated by ChEMBL
Assay Description
Binding affinity against nicotinic acetylcholine receptor alpha2-beta4 using [3H]epibatidine as radioligand expressed in HEK293 cells or tsA cells
J Med Chem 28: 1779-90 (1986)
BindingDB Entry DOI: 10.7270/Q2FJ2HC2
Renin
(Homo sapiens (Human))
BDBM50025944
(3-Hydroxy-4-[3-(1H-imidazol-4-yl)-2-(2-phenoxy-ace...)
Show SMILES CC(C)C[C@H](NC(=O)C[C@H](O)[C@H](Cc1ccccc1)NC(=O)[C@H](Cc1c[nH]cn1)NC(=O)COc1ccccc1)C(=O)N[C@@H](Cc1ccccc1)C(N)=O |r|
Show InChI InChI=1S/C40H49N7O7/c1-26(2)18-33(39(52)47-32(38(41)51)20-28-14-8-4-9-15-28)44-36(49)22-35(48)31(19-27-12-6-3-7-13-27)46-40(53)34(21-29-23-42-25-43-29)45-37(50)24-54-30-16-10-5-11-17-30/h3-17,23,25-26,31-35,48H,18-22,24H2,1-2H3,(H2,41,51)(H,42,43)(H,44,49)(H,45,50)(H,46,53)(H,47,52)
Reactome pathway
n/an/a>1.00E+3n/an/an/an/an/an/a
TBA
Curated by ChEMBL
Assay Description
Inhibition of human kidney renin
J Med Chem 28: 1779-90 (1986)
BindingDB Entry DOI: 10.7270/Q2FJ2HC2