BDBM50026003 4-(2-Imidazol-1-yl-ethoxy)-phenylamine::CHEMBL33689
SMILES: Nc1ccc(OCCn2ccnc2)cc1
InChI Key: InChIKey=AFRDTKWHTKFULR-UHFFFAOYSA-N
Data: 1 IC50
Activity Spreadsheet -- Enzyme Inhibition Constant Data from BindingDB
Found 1 hit for monomerid = 50026003
Trg + Lig
Ki
nM
ΔG°
kcal/mole
IC50
nM
Kd
nM
EC50/IC50
nM
koff
s-1
kon
M-1s-1
pHTemp
°C
Thromboxane A2 Synthase (P450 TxA2)
(Homo sapiens (Human))
BDBM50026003
(4-(2-Imidazol-1-yl-ethoxy)-phenylamine | CHEMBL336...)
Show SMILES Nc1ccc(OCCn2ccnc2)cc1
Show InChI InChI=1S/C11H13N3O/c12-10-1-3-11(4-2-10)15-8-7-14-6-5-13-9-14/h1-6,9H,7-8,12H2
n/an/a>5.00E+3n/an/an/an/an/an/a
TBA
Curated by ChEMBL
Assay Description
Inhibitory activity against thromboxane A2 synthetase
J Med Chem 28: 1427-32 (1985)
BindingDB Entry DOI: 10.7270/Q2DJ5DN7