BDBM50026216 1-Ethyl-1-(2-hydroxy-ethyl)-aziridinium; chloride::CHEMBL125756
SMILES: CC[N+]1(CCO)CC1
InChI Key: InChIKey=LZDYZEGISBDSDP-UHFFFAOYSA-N
Data: 1 IC50
Activity Spreadsheet -- Enzyme Inhibition Constant Data from BindingDB
Found 1 hit for monomerid = 50026216
Trg + Lig
Ki
nM
ΔG°
kcal/mole
IC50
nM
Kd
nM
EC50/IC50
nM
koff
s-1
kon
M-1s-1
pHTemp
°C
Choline transporter
(Mus musculus)
BDBM50026216
(1-Ethyl-1-(2-hydroxy-ethyl)-aziridinium; chloride ...)
Show SMILES CC[N+]1(CCO)CC1
Show InChI InChI=1S/C6H14NO/c1-2-7(3-4-7)5-6-8/h8H,2-6H2,1H3/q+1
Reactome pathway
n/an/a 1.50E+3n/an/an/an/an/an/a
TBA
Curated by ChEMBL
Assay Description
Compound was evaluated in vitro for its ability to inhibit the transport of [3H]-choline in to high affinity choline transport system HAChT
J Med Chem 29: 376-80 (1986)
BindingDB Entry DOI: 10.7270/Q2CJ8CHV