null
SMILES: [H][C@@]12C[C@@H](C[C@]1([H])CN(C2)C(=O)Nc1ccc(F)cc1C(O)=O)c1ccccc1C(F)(F)F
InChI Key: InChIKey=JLVUZSRCFYVLQG-ZSOGYDGISA-N
Activity Spreadsheet -- Enzyme Inhibition Constant Data from BindingDB
Found 6 hits for monomerid = 50026255
Trg + Lig
Ki
nM
ΔG°
kcal/mole
IC50
nM
Kd
nM
EC50/IC50
nM
koff
s-1
kon
M-1s-1
pHTemp
°C
Retinol-binding protein 4
(Homo sapiens (Human))
BDBM50026255
(CHEMBL3359017)
Show SMILES [H][C@@]12C[C@@H](C[C@]1([H])CN(C2)C(=O)Nc1ccc(F)cc1C(O)=O)c1ccccc1C(F)(F)F |r|
Show InChI InChI=1S/C22H20F4N2O3/c23-15-5-6-19(17(9-15)20(29)30)27-21(31)28-10-13-7-12(8-14(13)11-28)16-3-1-2-4-18(16)22(24,25)26/h1-6,9,12-14H,7-8,10-11H2,(H,27,31)(H,29,30)/t12-,13-,14+
Reactome pathway
n/an/a 0.285n/an/an/an/an/an/a
Albany Molecular Research
Curated by ChEMBL
Assay Description
Antagonist activity at maltose binding protein-tagged RBP4 (unknown origin) expressed in Escherichia coli assessed as inhibition of retinol-induced p...
J Med Chem 57: 7731-57 (2014)
Article DOI: 10.1021/jm5010013
BindingDB Entry DOI: 10.7270/Q2FB54JT
Retinol-binding protein 4
(Homo sapiens (Human))
BDBM50026255
(CHEMBL3359017)
Show SMILES [H][C@@]12C[C@@H](C[C@]1([H])CN(C2)C(=O)Nc1ccc(F)cc1C(O)=O)c1ccccc1C(F)(F)F |r|
Show InChI InChI=1S/C22H20F4N2O3/c23-15-5-6-19(17(9-15)20(29)30)27-21(31)28-10-13-7-12(8-14(13)11-28)16-3-1-2-4-18(16)22(24,25)26/h1-6,9,12-14H,7-8,10-11H2,(H,27,31)(H,29,30)/t12-,13-,14+
Reactome pathway
n/an/a 89n/an/an/an/an/an/a
Albany Molecular Research
Curated by ChEMBL
Assay Description
Displacement of [3H]retinol from biotinylated human RBP4 by scintillation proximity assay
J Med Chem 57: 7731-57 (2014)
Article DOI: 10.1021/jm5010013
BindingDB Entry DOI: 10.7270/Q2FB54JT
Cytochrome P450 3A4
(Homo sapiens (Human))
BDBM50026255
(CHEMBL3359017)
Show SMILES [H][C@@]12C[C@@H](C[C@]1([H])CN(C2)C(=O)Nc1ccc(F)cc1C(O)=O)c1ccccc1C(F)(F)F |r|
Show InChI InChI=1S/C22H20F4N2O3/c23-15-5-6-19(17(9-15)20(29)30)27-21(31)28-10-13-7-12(8-14(13)11-28)16-3-1-2-4-18(16)22(24,25)26/h1-6,9,12-14H,7-8,10-11H2,(H,27,31)(H,29,30)/t12-,13-,14+
Reactome pathway
n/an/a 5.30E+4n/an/an/an/an/an/a
Albany Molecular Research
Curated by ChEMBL
Assay Description
Inhibition of CYP3A4 (unknown origin)
J Med Chem 57: 7731-57 (2014)
Article DOI: 10.1021/jm5010013
BindingDB Entry DOI: 10.7270/Q2FB54JT
Cytochrome P450 2C19
(Homo sapiens (Human))
BDBM50026255
(CHEMBL3359017)
Show SMILES [H][C@@]12C[C@@H](C[C@]1([H])CN(C2)C(=O)Nc1ccc(F)cc1C(O)=O)c1ccccc1C(F)(F)F |r|
Show InChI InChI=1S/C22H20F4N2O3/c23-15-5-6-19(17(9-15)20(29)30)27-21(31)28-10-13-7-12(8-14(13)11-28)16-3-1-2-4-18(16)22(24,25)26/h1-6,9,12-14H,7-8,10-11H2,(H,27,31)(H,29,30)/t12-,13-,14+
Reactome pathway
n/an/a 3.10E+4n/an/an/an/an/an/a
Albany Molecular Research
Curated by ChEMBL
Assay Description
Inhibition of CYP2C19 (unknown origin)
J Med Chem 57: 7731-57 (2014)
Article DOI: 10.1021/jm5010013
BindingDB Entry DOI: 10.7270/Q2FB54JT
Cytochrome P450 2D6
(Homo sapiens (Human))
BDBM50026255
(CHEMBL3359017)
Show SMILES [H][C@@]12C[C@@H](C[C@]1([H])CN(C2)C(=O)Nc1ccc(F)cc1C(O)=O)c1ccccc1C(F)(F)F |r|
Show InChI InChI=1S/C22H20F4N2O3/c23-15-5-6-19(17(9-15)20(29)30)27-21(31)28-10-13-7-12(8-14(13)11-28)16-3-1-2-4-18(16)22(24,25)26/h1-6,9,12-14H,7-8,10-11H2,(H,27,31)(H,29,30)/t12-,13-,14+
n/an/a>1.00E+5n/an/an/an/an/an/a
Albany Molecular Research
Curated by ChEMBL
Assay Description
Inhibition of CYP2D6 (unknown origin)
J Med Chem 57: 7731-57 (2014)
Article DOI: 10.1021/jm5010013
BindingDB Entry DOI: 10.7270/Q2FB54JT
Cytochrome P450 2C9
(Homo sapiens (Human))
BDBM50026255
(CHEMBL3359017)
Show SMILES [H][C@@]12C[C@@H](C[C@]1([H])CN(C2)C(=O)Nc1ccc(F)cc1C(O)=O)c1ccccc1C(F)(F)F |r|
Show InChI InChI=1S/C22H20F4N2O3/c23-15-5-6-19(17(9-15)20(29)30)27-21(31)28-10-13-7-12(8-14(13)11-28)16-3-1-2-4-18(16)22(24,25)26/h1-6,9,12-14H,7-8,10-11H2,(H,27,31)(H,29,30)/t12-,13-,14+
Reactome pathway
n/an/a 330n/an/an/an/an/an/a
Albany Molecular Research
Curated by ChEMBL
Assay Description
Inhibition of CYP2C9 (unknown origin)
J Med Chem 57: 7731-57 (2014)
Article DOI: 10.1021/jm5010013
BindingDB Entry DOI: 10.7270/Q2FB54JT