BDBM50026435 CHEMBL3335296
SMILES: ONC(=O)CCCCc1ccn(Cc2ccc(OCc3ccccc3)cc2)n1
InChI Key: InChIKey=TTZOOHJPRMQTAK-UHFFFAOYSA-N
Data: 1 IC50
Activity Spreadsheet -- Enzyme Inhibition Constant Data from BindingDB
Found 1 hit for monomerid = 50026435
Trg + Lig
Ki
nM
ΔG°
kcal/mole
IC50
nM
Kd
nM
EC50/IC50
nM
koff
s-1
kon
M-1s-1
pHTemp
°C
Histone deacetylase 1
(Homo sapiens (Human))
BDBM50026435
(CHEMBL3335296)
Show SMILES ONC(=O)CCCCc1ccn(Cc2ccc(OCc3ccccc3)cc2)n1
Show InChI InChI=1S/C22H25N3O3/c26-22(24-27)9-5-4-8-20-14-15-25(23-20)16-18-10-12-21(13-11-18)28-17-19-6-2-1-3-7-19/h1-3,6-7,10-15,27H,4-5,8-9,16-17H2,(H,24,26)
NCI pathway
Reactome pathway
n/an/a 67n/an/an/an/an/an/a
Chinese Academy of Sciences
Curated by ChEMBL
Assay Description
Inhibition of human recombinant HDAC1 after 60 mins by fluorimetric assay
Eur J Med Chem 86: 639-52 (2014)
Article DOI: 10.1016/j.ejmech.2014.09.024
BindingDB Entry DOI: 10.7270/Q2NV9KTB