BDBM50026452 CHEMBL3335281
SMILES: ONC(=O)CCCCc1nccn1Cc1cccc(c1)-c1ccccc1
InChI Key: InChIKey=HOPIRRMKRRNWLJ-UHFFFAOYSA-N
Data: 1 IC50
Activity Spreadsheet -- Enzyme Inhibition Constant Data from BindingDB
Found 1 hit for monomerid = 50026452
Trg + Lig
Ki
nM
ΔG°
kcal/mole
IC50
nM
Kd
nM
EC50/IC50
nM
koff
s-1
kon
M-1s-1
pHTemp
°C
Histone deacetylase 1
(Homo sapiens (Human))
BDBM50026452
(CHEMBL3335281)
Show SMILES ONC(=O)CCCCc1nccn1Cc1cccc(c1)-c1ccccc1
Show InChI InChI=1S/C21H23N3O2/c25-21(23-26)12-5-4-11-20-22-13-14-24(20)16-17-7-6-10-19(15-17)18-8-2-1-3-9-18/h1-3,6-10,13-15,26H,4-5,11-12,16H2,(H,23,25)
NCI pathway
Reactome pathway
n/an/a 367n/an/an/an/an/an/a
Chinese Academy of Sciences
Curated by ChEMBL
Assay Description
Inhibition of human recombinant HDAC1 after 60 mins by fluorimetric assay
Eur J Med Chem 86: 639-52 (2014)
Article DOI: 10.1016/j.ejmech.2014.09.024
BindingDB Entry DOI: 10.7270/Q2NV9KTB