BDBM50026611 CHEMBL3335361
SMILES: Oc1ccc2sc(cc2c1)C(=O)c1ccccc1
InChI Key: InChIKey=QKNWFPRGYBXQMF-UHFFFAOYSA-N
Data: 3 IC50
Activity Spreadsheet -- Enzyme Inhibition Constant Data from BindingDB
Found 3 hits for monomerid = 50026611
Trg + Lig
Ki
nM
ΔG°
kcal/mole
IC50
nM
Kd
nM
EC50/IC50
nM
koff
s-1
kon
M-1s-1
pHTemp
°C
Dual-specificity tyrosine-phosphorylation regulated kinase 1A
(Homo sapiens (Human))
BDBM50026611
(CHEMBL3335361)
Show SMILES Oc1ccc2sc(cc2c1)C(=O)c1ccccc1
Show InChI InChI=1S/C15H10O2S/c16-12-6-7-13-11(8-12)9-14(18-13)15(17)10-4-2-1-3-5-10/h1-9,16H
Reactome pathway
n/an/a 2.00E+3n/an/an/an/an/an/a
Saarland University
Curated by ChEMBL
Assay Description
Inhibition of recombinant Dyrk1A (unknown origin) using KKISGRLSPIMTEQ-NH2 peptide substrate
ACS Med Chem Lett 5: 963-7 (2014)
Article DOI: 10.1021/ml500059y
BindingDB Entry DOI: 10.7270/Q28K7BPQ
Dual specificty protein kinase CLK1
(Homo sapiens (Human))
BDBM50026611
(CHEMBL3335361)
Show SMILES Oc1ccc2sc(cc2c1)C(=O)c1ccccc1
Show InChI InChI=1S/C15H10O2S/c16-12-6-7-13-11(8-12)9-14(18-13)15(17)10-4-2-1-3-5-10/h1-9,16H
n/an/a 200n/an/an/an/an/an/a
Saarland University
Curated by ChEMBL
Assay Description
Inhibition of recombinant Clk1 (unknown origin) using GRSRSRSRSR peptide substrate
ACS Med Chem Lett 5: 963-7 (2014)
Article DOI: 10.1021/ml500059y
BindingDB Entry DOI: 10.7270/Q28K7BPQ
Dual-specificity tyrosine-regulated kinases 1B
(Homo sapiens (Human))
BDBM50026611
(CHEMBL3335361)
Show SMILES Oc1ccc2sc(cc2c1)C(=O)c1ccccc1
Show InChI InChI=1S/C15H10O2S/c16-12-6-7-13-11(8-12)9-14(18-13)15(17)10-4-2-1-3-5-10/h1-9,16H
n/an/a 1.00E+3n/an/an/an/an/an/a
Saarland University
Curated by ChEMBL
Assay Description
Inhibition of recombinant Dyrk1B (unknown origin) using KKISGRLSPIMTEQ-NH2 peptide substrate
ACS Med Chem Lett 5: 963-7 (2014)
Article DOI: 10.1021/ml500059y
BindingDB Entry DOI: 10.7270/Q28K7BPQ