BDBM50026621 CHEMBL3335365
SMILES: CON(C)C(=O)c1cc2cc(OC)ccc2s1
InChI Key: InChIKey=GQVSWGAIIWEDCW-UHFFFAOYSA-N
Data: 3 IC50
Activity Spreadsheet -- Enzyme Inhibition Constant Data from BindingDB
Found 3 hits for monomerid = 50026621
Trg + Lig
Ki
nM
ΔG°
kcal/mole
IC50
nM
Kd
nM
EC50/IC50
nM
koff
s-1
kon
M-1s-1
pHTemp
°C
Dual-specificity tyrosine-phosphorylation regulated kinase 1A
(Homo sapiens (Human))
BDBM50026621
(CHEMBL3335365)
Show SMILES CON(C)C(=O)c1cc2cc(OC)ccc2s1
Show InChI InChI=1S/C12H13NO3S/c1-13(16-3)12(14)11-7-8-6-9(15-2)4-5-10(8)17-11/h4-7H,1-3H3
Reactome pathway
n/an/a 900n/an/an/an/an/an/a
Saarland University
Curated by ChEMBL
Assay Description
Inhibition of recombinant Dyrk1A (unknown origin) using KKISGRLSPIMTEQ-NH2 peptide substrate
ACS Med Chem Lett 5: 963-7 (2014)
Article DOI: 10.1021/ml500059y
BindingDB Entry DOI: 10.7270/Q28K7BPQ
Dual specificty protein kinase CLK1
(Homo sapiens (Human))
BDBM50026621
(CHEMBL3335365)
Show SMILES CON(C)C(=O)c1cc2cc(OC)ccc2s1
Show InChI InChI=1S/C12H13NO3S/c1-13(16-3)12(14)11-7-8-6-9(15-2)4-5-10(8)17-11/h4-7H,1-3H3
n/an/a 100n/an/an/an/an/an/a
Saarland University
Curated by ChEMBL
Assay Description
Inhibition of recombinant Clk1 (unknown origin) using GRSRSRSRSR peptide substrate
ACS Med Chem Lett 5: 963-7 (2014)
Article DOI: 10.1021/ml500059y
BindingDB Entry DOI: 10.7270/Q28K7BPQ
Dual-specificity tyrosine-regulated kinases 1B
(Homo sapiens (Human))
BDBM50026621
(CHEMBL3335365)
Show SMILES CON(C)C(=O)c1cc2cc(OC)ccc2s1
Show InChI InChI=1S/C12H13NO3S/c1-13(16-3)12(14)11-7-8-6-9(15-2)4-5-10(8)17-11/h4-7H,1-3H3
n/an/a 1.60E+3n/an/an/an/an/an/a
Saarland University
Curated by ChEMBL
Assay Description
Inhibition of recombinant Dyrk1B (unknown origin) using KKISGRLSPIMTEQ-NH2 peptide substrate
ACS Med Chem Lett 5: 963-7 (2014)
Article DOI: 10.1021/ml500059y
BindingDB Entry DOI: 10.7270/Q28K7BPQ