null
SMILES: CN1CCC(CC1)C(=O)Nc1cc(Oc2ccc3n(C)c(Nc4cccc(c4)C(C)(C)C)nc3c2)ccn1
InChI Key: InChIKey=UFZLFECVKGGBOA-UHFFFAOYSA-N
Activity Spreadsheet -- Enzyme Inhibition Constant Data from BindingDB
Found 2 hits for monomerid = 50026675
Trg + Lig
Ki
nM
ΔG°
kcal/mole
IC50
nM
Kd
nM
EC50/IC50
nM
koff
s-1
kon
M-1s-1
pHTemp
°C
Serine/threonine-protein kinase B-raf
(Homo sapiens (Human))
BDBM50026675
(CHEMBL3335383)
Show SMILES CN1CCC(CC1)C(=O)Nc1cc(Oc2ccc3n(C)c(Nc4cccc(c4)C(C)(C)C)nc3c2)ccn1
Show InChI InChI=1S/C30H36N6O2/c1-30(2,3)21-7-6-8-22(17-21)32-29-33-25-18-23(9-10-26(25)36(29)5)38-24-11-14-31-27(19-24)34-28(37)20-12-15-35(4)16-13-20/h6-11,14,17-20H,12-13,15-16H2,1-5H3,(H,32,33)(H,31,34,37)
NCI pathway
Reactome pathway
n/an/a 10n/an/an/an/an/an/a
Novartis Institutes for Biomedical Research
Curated by ChEMBL
Assay Description
Inhibition of BRAF V600E mutant (unknown origin)
ACS Med Chem Lett 5: 989-92 (2014)
Article DOI: 10.1021/ml5002272
BindingDB Entry DOI: 10.7270/Q2RN39FP
Serine/threonine-protein kinase B-raf
(Homo sapiens (Human))
BDBM50026675
(CHEMBL3335383)
Show SMILES CN1CCC(CC1)C(=O)Nc1cc(Oc2ccc3n(C)c(Nc4cccc(c4)C(C)(C)C)nc3c2)ccn1
Show InChI InChI=1S/C30H36N6O2/c1-30(2,3)21-7-6-8-22(17-21)32-29-33-25-18-23(9-10-26(25)36(29)5)38-24-11-14-31-27(19-24)34-28(37)20-12-15-35(4)16-13-20/h6-11,14,17-20H,12-13,15-16H2,1-5H3,(H,32,33)(H,31,34,37)
NCI pathway
Reactome pathway
n/an/an/an/a 100n/an/an/an/a
Novartis Institutes for Biomedical Research
Curated by ChEMBL
Assay Description
Inhibition of BRAF (unknown origin)-mediated ERK phosphorylation by cell-based assay
ACS Med Chem Lett 5: 989-92 (2014)
Article DOI: 10.1021/ml5002272
BindingDB Entry DOI: 10.7270/Q2RN39FP