BDBM50026680 CHEMBL3335385
SMILES: CC(C)N1CCC(CC1)C(=O)Nc1cc(Oc2ccc3n(C)c(Nc4cc(ccc4F)C(F)(F)F)nc3c2)ccn1
InChI Key: InChIKey=NLHOWBQQPCBEPZ-UHFFFAOYSA-N
Data: 1 IC50  1 EC50
Activity Spreadsheet -- Enzyme Inhibition Constant Data from BindingDB
Found 2 hits for monomerid = 50026680
Trg + Lig
Ki
nM
ΔG°
kcal/mole
IC50
nM
Kd
nM
EC50/IC50
nM
koff
s-1
kon
M-1s-1
pHTemp
°C
Serine/threonine-protein kinase B-raf
(Homo sapiens (Human))
BDBM50026680
(CHEMBL3335385)
Show SMILES CC(C)N1CCC(CC1)C(=O)Nc1cc(Oc2ccc3n(C)c(Nc4cc(ccc4F)C(F)(F)F)nc3c2)ccn1
Show InChI InChI=1S/C29H30F4N6O2/c1-17(2)39-12-9-18(10-13-39)27(40)37-26-16-21(8-11-34-26)41-20-5-7-25-24(15-20)36-28(38(25)3)35-23-14-19(29(31,32)33)4-6-22(23)30/h4-8,11,14-18H,9-10,12-13H2,1-3H3,(H,35,36)(H,34,37,40)
NCI pathway
Reactome pathway
n/an/an/an/a 100n/an/an/an/a
Novartis Institutes for Biomedical Research
Curated by ChEMBL
Assay Description
Inhibition of BRAF (unknown origin)-mediated ERK phosphorylation by cell-based assay
ACS Med Chem Lett 5: 989-92 (2014)
Article DOI: 10.1021/ml5002272
BindingDB Entry DOI: 10.7270/Q2RN39FP
Serine/threonine-protein kinase B-raf
(Homo sapiens (Human))
BDBM50026680
(CHEMBL3335385)
Show SMILES CC(C)N1CCC(CC1)C(=O)Nc1cc(Oc2ccc3n(C)c(Nc4cc(ccc4F)C(F)(F)F)nc3c2)ccn1
Show InChI InChI=1S/C29H30F4N6O2/c1-17(2)39-12-9-18(10-13-39)27(40)37-26-16-21(8-11-34-26)41-20-5-7-25-24(15-20)36-28(38(25)3)35-23-14-19(29(31,32)33)4-6-22(23)30/h4-8,11,14-18H,9-10,12-13H2,1-3H3,(H,35,36)(H,34,37,40)
NCI pathway
Reactome pathway
n/an/a 2n/an/an/an/an/an/a
Novartis Institutes for Biomedical Research
Curated by ChEMBL
Assay Description
Inhibition of BRAF V600E mutant (unknown origin)
ACS Med Chem Lett 5: 989-92 (2014)
Article DOI: 10.1021/ml5002272
BindingDB Entry DOI: 10.7270/Q2RN39FP