BDBM50026751 CHEMBL3354619
SMILES: OC1=C(Cc2ccccc2)C(=O)C(Cc2cccc3CC(CCc23)NS(=O)(=O)c2ccc(Cl)cc2)C1
InChI Key: InChIKey=BISWQQVGNDSUFN-UHFFFAOYSA-N
Data: 1 IC50
Activity Spreadsheet -- Enzyme Inhibition Constant Data from BindingDB
Found 1 hit for monomerid = 50026751
Trg + Lig
Ki
nM
ΔG°
kcal/mole
IC50
nM
Kd
nM
EC50/IC50
nM
koff
s-1
kon
M-1s-1
pHTemp
°C
Prostanoid TP receptor
(Homo sapiens (Human))
BDBM50026751
(CHEMBL3354619)
Show SMILES OC1=C(Cc2ccccc2)C(=O)C(Cc2cccc3CC(CCc23)NS(=O)(=O)c2ccc(Cl)cc2)C1 |c:1|
Show InChI InChI=1S/C29H28ClNO4S/c30-23-9-12-25(13-10-23)36(34,35)31-24-11-14-26-20(7-4-8-21(26)17-24)16-22-18-28(32)27(29(22)33)15-19-5-2-1-3-6-19/h1-10,12-13,22,24,31-32H,11,14-18H2
n/an/a 29n/an/an/an/an/an/a
University of Pennsylvania
Curated by ChEMBL
Assay Description
Antagonist activity against human thromboxane A2 receptor alpha expressed in QBI-HEK293A cells assessed as reduction in I-BOP-induced inositol monoph...
ACS Med Chem Lett 5: 1015-20 (2014)
Article DOI: 10.1021/ml5002085
BindingDB Entry DOI: 10.7270/Q27M09HF