BDBM50026755 CHEMBL3335482
SMILES: OC1=C(C(=O)C(Cc2cccc(CCNS(=O)(=O)c3ccc(Cl)cc3)c2)C1)c1ccccc1
InChI Key: InChIKey=JHOUUOCFBJPMGV-UHFFFAOYSA-N
Data: 1 IC50
Activity Spreadsheet -- Enzyme Inhibition Constant Data from BindingDB
Found 1 hit for monomerid = 50026755
Trg + Lig
Ki
nM
ΔG°
kcal/mole
IC50
nM
Kd
nM
EC50/IC50
nM
koff
s-1
kon
M-1s-1
pHTemp
°C
Prostanoid TP receptor
(Homo sapiens (Human))
BDBM50026755
(CHEMBL3335482)
Show SMILES OC1=C(C(=O)C(Cc2cccc(CCNS(=O)(=O)c3ccc(Cl)cc3)c2)C1)c1ccccc1 |t:1|
Show InChI InChI=1S/C26H24ClNO4S/c27-22-9-11-23(12-10-22)33(31,32)28-14-13-18-5-4-6-19(15-18)16-21-17-24(29)25(26(21)30)20-7-2-1-3-8-20/h1-12,15,21,28-29H,13-14,16-17H2
n/an/a 59n/an/an/an/an/an/a
University of Pennsylvania
Curated by ChEMBL
Assay Description
Antagonist activity against human thromboxane A2 receptor alpha expressed in QBI-HEK293A cells assessed as reduction in I-BOP-induced inositol monoph...
ACS Med Chem Lett 5: 1015-20 (2014)
Article DOI: 10.1021/ml5002085
BindingDB Entry DOI: 10.7270/Q27M09HF