BDBM50026833 CHEMBL1957083
SMILES: COc1ccc(cc1)-c1ocnc1C(=O)NCc1ccccn1
InChI Key: InChIKey=FYBSLTNJJIEOIJ-UHFFFAOYSA-N
Data: 1 IC50
Activity Spreadsheet -- Enzyme Inhibition Constant Data from BindingDB
Found 1 hit for monomerid = 50026833
Trg + Lig
Ki
nM
ΔG°
kcal/mole
IC50
nM
Kd
nM
EC50/IC50
nM
koff
s-1
kon
M-1s-1
pHTemp
°C
Glycogen synthase kinase-3 beta
(Homo sapiens (Human))
BDBM50026833
(CHEMBL1957083)
Show SMILES COc1ccc(cc1)-c1ocnc1C(=O)NCc1ccccn1
Show InChI InChI=1S/C17H15N3O3/c1-22-14-7-5-12(6-8-14)16-15(20-11-23-16)17(21)19-10-13-4-2-3-9-18-13/h2-9,11H,10H2,1H3,(H,19,21)
NCI pathway
Reactome pathway
n/an/a 2.00E+3n/an/an/an/an/an/a
GlaxoSmithKline
Curated by ChEMBL
Assay Description
Inhibition of GSK3-beta by fluorescence polarization assay
Bioorg Med Chem Lett 22: 1989-94 (2012)
Article DOI: 10.1016/j.bmcl.2012.01.034
BindingDB Entry DOI: 10.7270/Q2ZP46KT