BDBM50026866 CHEMBL1957090
SMILES: NC(=O)c1cccc(c1)-c1ocnc1C(=O)NCc1ccncc1
InChI Key: InChIKey=CMVWBPVSUGWWDZ-UHFFFAOYSA-N
Data: 1 IC50
Activity Spreadsheet -- Enzyme Inhibition Constant Data from BindingDB
Found 1 hit for monomerid = 50026866
Trg + Lig
Ki
nM
ΔG°
kcal/mole
IC50
nM
Kd
nM
EC50/IC50
nM
koff
s-1
kon
M-1s-1
pHTemp
°C
Glycogen synthase kinase-3 beta
(Homo sapiens (Human))
BDBM50026866
(CHEMBL1957090)
Show SMILES NC(=O)c1cccc(c1)-c1ocnc1C(=O)NCc1ccncc1
Show InChI InChI=1S/C17H14N4O3/c18-16(22)13-3-1-2-12(8-13)15-14(21-10-24-15)17(23)20-9-11-4-6-19-7-5-11/h1-8,10H,9H2,(H2,18,22)(H,20,23)
NCI pathway
Reactome pathway
n/an/a 7.94E+3n/an/an/an/an/an/a
GlaxoSmithKline
Curated by ChEMBL
Assay Description
Inhibition of GSK3-beta by fluorescence polarization assay
Bioorg Med Chem Lett 22: 1989-94 (2012)
Article DOI: 10.1016/j.bmcl.2012.01.034
BindingDB Entry DOI: 10.7270/Q2ZP46KT