null
SMILES: [H][C@@]1([C@@H](C)CC)N(C)C(=O)CN(C)C(=O)[C@H](CC)NC(=O)[C@]([H])([C@H](O)[C@H](C)C\C=C\CC)N(C)C(=O)[C@H](C(C)C)N(C)C(=O)[C@H](CC(C)C)N(C)C(=O)[C@H](CC(C)C)N(C)C(=O)[C@@H](C)NC(=O)[C@H](C)NC(=O)[C@@H](CC(C)C)N(C)C(=O)[C@H](NC1=O)C(C)C
InChI Key: InChIKey=NRBCQRWZDRFLLR-XULUQCDHSA-N
Activity Spreadsheet -- Enzyme Inhibition Constant Data from BindingDB
Found 1 hit for monomerid = 50026896
Trg + Lig
Ki
nM
ΔG°
kcal/mole
IC50
nM
Kd
nM
EC50/IC50
nM
koff
s-1
kon
M-1s-1
pHTemp
°C
fMet-Leu-Phe receptor
(Homo sapiens (Human))
BDBM50026896
(CHEMBL2372466)
Show SMILES [H][C@@]1([C@@H](C)CC)N(C)C(=O)CN(C)C(=O)[C@H](CC)NC(=O)[C@]([H])([C@H](O)[C@H](C)C\C=C\CC)N(C)C(=O)[C@H](C(C)C)N(C)C(=O)[C@H](CC(C)C)N(C)C(=O)[C@H](CC(C)C)N(C)C(=O)[C@@H](C)NC(=O)[C@H](C)NC(=O)[C@@H](CC(C)C)N(C)C(=O)[C@H](NC1=O)C(C)C |r|
Show InChI InChI=1S/C63H113N11O12/c1-25-28-29-30-41(15)53(76)52-57(80)66-44(27-3)59(82)68(18)34-48(75)72(22)51(40(14)26-2)56(79)67-49(38(10)11)62(85)69(19)45(31-35(4)5)55(78)64-42(16)54(77)65-43(17)58(81)70(20)46(32-36(6)7)60(83)71(21)47(33-37(8)9)61(84)73(23)50(39(12)13)63(86)74(52)24/h28-29,35-47,49-53,76H,25-27,30-34H2,1-24H3,(H,64,78)(H,65,77)(H,66,80)(H,67,79)/b29-28+/t40-,41+,42-,43+,44-,45+,46-,47-,49+,50-,51-,52-,53+/m0/s1
Reactome pathway
n/an/a 7.00E+3n/an/an/an/an/an/a
Strasbourg 1 University
Curated by ChEMBL
Assay Description
Inhibitory activity against human formylpeptide receptor (FPR) of human leukemia HL-60 cells
J Med Chem 45: 4613-28 (2002)
BindingDB Entry DOI: 10.7270/Q2571CQX