null
SMILES: [H][C@]1(NC(=O)[C@]([H])([C@H](O)[C@H](C)C\C=C\C)N(C)C(=O)[C@@H](NC(=O)[C@H](CC(C)C)N(C)C(=O)[C@H](CC(C)C)N(C)C(=O)[C@@H](C)NC(=O)[C@H](C)NC(=O)[C@@H](CC(C)C)N(C)C(=O)[C@H](NC(=O)[C@@H](CC(C)C)N(C)C(=O)CN(C)C1=O)C(C)C)C(C)C)[C@@H](C)O
InChI Key: InChIKey=VHAAQDUGYGVCKU-UFJGLTTCSA-N
Activity Spreadsheet -- Enzyme Inhibition Constant Data from BindingDB
Found 1 hit for monomerid = 50026900
Trg + Lig
Ki
nM
ΔG°
kcal/mole
IC50
nM
Kd
nM
EC50/IC50
nM
koff
s-1
kon
M-1s-1
pHTemp
°C
fMet-Leu-Phe receptor
(Homo sapiens (Human))
BDBM50026900
(CHEMBL2372479)
Show SMILES [H][C@]1(NC(=O)[C@]([H])([C@H](O)[C@H](C)C\C=C\C)N(C)C(=O)[C@@H](NC(=O)[C@H](CC(C)C)N(C)C(=O)[C@H](CC(C)C)N(C)C(=O)[C@@H](C)NC(=O)[C@H](C)NC(=O)[C@@H](CC(C)C)N(C)C(=O)[C@H](NC(=O)[C@@H](CC(C)C)N(C)C(=O)CN(C)C1=O)C(C)C)C(C)C)[C@@H](C)O |r|
Show InChI InChI=1S/C61H109N11O13/c1-24-25-26-38(14)51(75)50-56(80)66-49(41(17)73)59(83)67(18)31-46(74)68(19)42(27-32(2)3)54(78)64-47(36(10)11)60(84)70(21)43(28-33(4)5)53(77)62-39(15)52(76)63-40(16)57(81)71(22)45(30-35(8)9)58(82)69(20)44(29-34(6)7)55(79)65-48(37(12)13)61(85)72(50)23/h24-25,32-45,47-51,73,75H,26-31H2,1-23H3,(H,62,77)(H,63,76)(H,64,78)(H,65,79)(H,66,80)/b25-24+/t38-,39+,40-,41-,42-,43-,44+,45+,47-,48+,49+,50+,51-/m1/s1
Reactome pathway
n/an/a>1.00E+4n/an/an/an/an/an/a
Strasbourg 1 University
Curated by ChEMBL
Assay Description
Inhibitory activity against human formylpeptide receptor (FPR) of human leukemia HL-60 cells
J Med Chem 45: 4613-28 (2002)
BindingDB Entry DOI: 10.7270/Q2571CQX