null
SMILES: CCC[C@@H]1NC(=O)[C@H](CC(C)C)N(C)C(=O)[C@H](C(C)C)N(C)C(=O)[C@H](CC(C)C)N(C)C(=O)[C@H](CC(C)C)N(C)C(=O)[C@@H](C)NC(=O)[C@H](C)NC(=O)[C@@H](CC(C)C)N(C)C(=O)[C@@H](NC(=O)[C@@H](CC(C)C)N(C)C(=O)CN(C)C1=O)C(C)C
InChI Key: InChIKey=NLGBWFHSHJPDQX-PASYTOIYSA-N
Activity Spreadsheet -- Enzyme Inhibition Constant Data from BindingDB
Found 1 hit for monomerid = 50026929
Trg + Lig
Ki
nM
ΔG°
kcal/mole
IC50
nM
Kd
nM
EC50/IC50
nM
koff
s-1
kon
M-1s-1
pHTemp
°C
fMet-Leu-Phe receptor
(Homo sapiens (Human))
BDBM50026929
(CHEMBL2372457)
Show SMILES CCC[C@@H]1NC(=O)[C@H](CC(C)C)N(C)C(=O)[C@H](C(C)C)N(C)C(=O)[C@H](CC(C)C)N(C)C(=O)[C@H](CC(C)C)N(C)C(=O)[C@@H](C)NC(=O)[C@H](C)NC(=O)[C@@H](CC(C)C)N(C)C(=O)[C@@H](NC(=O)[C@@H](CC(C)C)N(C)C(=O)CN(C)C1=O)C(C)C |r|
Show InChI InChI=1S/C60H109N11O11/c1-25-26-42-56(78)65(18)32-48(72)66(19)43(27-33(2)3)54(76)64-49(38(12)13)59(81)67(20)44(28-34(4)5)52(74)61-40(16)51(73)62-41(17)55(77)69(22)46(30-36(8)9)57(79)70(23)47(31-37(10)11)58(80)71(24)50(39(14)15)60(82)68(21)45(29-35(6)7)53(75)63-42/h33-47,49-50H,25-32H2,1-24H3,(H,61,74)(H,62,73)(H,63,75)(H,64,76)/t40-,41+,42-,43+,44+,45-,46-,47-,49-,50-/m0/s1
Reactome pathway
n/an/a>1.00E+4n/an/an/an/an/an/a
Strasbourg 1 University
Curated by ChEMBL
Assay Description
Inhibitory activity against human formylpeptide receptor (FPR) of human leukemia HL-60 cells
J Med Chem 45: 4613-28 (2002)
BindingDB Entry DOI: 10.7270/Q2571CQX