BDBM50027111 26-(4-aminohexahydro-1-pyrazinyliminomethyl)-2,15,17,29-tetrahydroxy-11-methoxy-3,7,12,14,16,18,22-heptamethyl-6,23-dioxo-8,30-dioxa-24-azatetracyclo[23.3.1.14,7.05,28]triaconta-1(28),2,4,9,19,21,25(29),26-octaen-13-yl acetate::CHEMBL87915
SMILES: COC1\C=C\OC2(C)Oc3c(C2=O)c2cc(\C=N\N4CCN(N)CC4)c(NC(=O)\C(C)=C/C=C/C(C)C(O)C(C)C(O)C(C)C(OC(C)=O)C1C)c(O)c2c(O)c3C
InChI Key: InChIKey=DBVKKUZWKVDDFE-HBEKSAQNSA-N
Data: 2 IC50
Activity Spreadsheet -- Enzyme Inhibition Constant Data from BindingDB
Found 2 hits for monomerid = 50027111
Trg + Lig
Ki
nM
ΔG°
kcal/mole
IC50
nM
Kd
nM
EC50/IC50
nM
koff
s-1
kon
M-1s-1
pHTemp
°C
DNA polymerase beta
(Mus musculus)
BDBM50027111
(26-(4-aminohexahydro-1-pyrazinyliminomethyl)-2,15,...)
Show SMILES COC1\C=C\OC2(C)Oc3c(C2=O)c2cc(\C=N\N4CCN(N)CC4)c(NC(=O)\C(C)=C/C=C/C(C)C(O)C(C)C(O)C(C)C(OC(C)=O)C1C)c(O)c2c(O)c3C |c:32,t:3,34|
Show InChI InChI=1S/C42H57N5O11/c1-21-11-10-12-22(2)41(54)45-33-28(20-44-47-16-14-46(43)15-17-47)19-29-31(37(33)52)36(51)26(6)39-32(29)40(53)42(8,58-39)56-18-13-30(55-9)23(3)38(57-27(7)48)25(5)35(50)24(4)34(21)49/h10-13,18-21,23-25,30,34-35,38,49-52H,14-17,43H2,1-9H3,(H,45,54)/b11-10+,18-13+,22-12-,44-20+
Reactome pathway
n/an/a 1.60E+4n/an/an/an/an/an/a
TBA
Curated by ChEMBL
Assay Description
Ability to inhibit mouse beta DNA polymerase
J Med Chem 23: 256-61 (1980)
BindingDB Entry DOI: 10.7270/Q2XD10PG
Simian sarcoma virus Pol protein
(Woolly monkey sarcoma virus)
BDBM50027111
(26-(4-aminohexahydro-1-pyrazinyliminomethyl)-2,15,...)
Show SMILES COC1\C=C\OC2(C)Oc3c(C2=O)c2cc(\C=N\N4CCN(N)CC4)c(NC(=O)\C(C)=C/C=C/C(C)C(O)C(C)C(O)C(C)C(OC(C)=O)C1C)c(O)c2c(O)c3C |c:32,t:3,34|
Show InChI InChI=1S/C42H57N5O11/c1-21-11-10-12-22(2)41(54)45-33-28(20-44-47-16-14-46(43)15-17-47)19-29-31(37(33)52)36(51)26(6)39-32(29)40(53)42(8,58-39)56-18-13-30(55-9)23(3)38(57-27(7)48)25(5)35(50)24(4)34(21)49/h10-13,18-21,23-25,30,34-35,38,49-52H,14-17,43H2,1-9H3,(H,45,54)/b11-10+,18-13+,22-12-,44-20+
n/an/a 2.50E+4n/an/an/an/an/an/a
TBA
Curated by ChEMBL
Assay Description
Ability to inhibit simian sarcoma virus reverse transcriptase
J Med Chem 23: 256-61 (1980)
BindingDB Entry DOI: 10.7270/Q2XD10PG