BDBM50027186 CHEMBL377289
SMILES: COc1cc2c(Nc3ncc(CC(=O)Nc4cccc(F)c4)s3)ncnc2cc1OCCCN(CCO)CC#C
InChI Key: InChIKey=MQKDXIHEYWTCLH-UHFFFAOYSA-N
Data: 1 IC50
Activity Spreadsheet -- Enzyme Inhibition Constant Data from BindingDB
Found 1 hit for monomerid = 50027186
Trg + Lig
Ki
nM
ΔG°
kcal/mole
IC50
nM
Kd
nM
EC50/IC50
nM
koff
s-1
kon
M-1s-1
pHTemp
°C
Aurora kinase A
(Homo sapiens (Human))
BDBM50027186
(CHEMBL377289)
Show SMILES COc1cc2c(Nc3ncc(CC(=O)Nc4cccc(F)c4)s3)ncnc2cc1OCCCN(CCO)CC#C
Show InChI InChI=1S/C28H29FN6O4S/c1-3-8-35(10-11-36)9-5-12-39-25-16-23-22(15-24(25)38-2)27(32-18-31-23)34-28-30-17-21(40-28)14-26(37)33-20-7-4-6-19(29)13-20/h1,4,6-7,13,15-18,36H,5,8-12,14H2,2H3,(H,33,37)(H,30,31,32,34)
NCI pathway
Reactome pathway
n/an/a<1n/an/an/an/an/an/a
Centre de Recherches
Curated by ChEMBL
Assay Description
Inhibition of Aurora A kinase activity
J Med Chem 49: 955-70 (2006)
Article DOI: 10.1021/jm050786h
BindingDB Entry DOI: 10.7270/Q24J0FXV