null
SMILES: OS(=O)(=O)CCNc1c(Br)cccc1Nc1ncnc2ccncc12
InChI Key: InChIKey=BYQCSRHAARJJML-UHFFFAOYSA-N
Activity Spreadsheet -- Enzyme Inhibition Constant Data from BindingDB
Found 1 hit for monomerid = 50027276
Trg + Lig
Ki
nM
ΔG°
kcal/mole
IC50
nM
Kd
nM
EC50/IC50
nM
koff
s-1
kon
M-1s-1
pHTemp
°C
Epidermal growth factor receptor
(Homo sapiens (Human))
BDBM50027276
(CHEMBL270895)
Show SMILES OS(=O)(=O)CCNc1c(Br)cccc1Nc1ncnc2ccncc12
Show InChI InChI=1S/C15H14BrN5O3S/c16-11-2-1-3-13(14(11)18-6-7-25(22,23)24)21-15-10-8-17-5-4-12(10)19-9-20-15/h1-5,8-9,18H,6-7H2,(H,19,20,21)(H,22,23,24)
n/an/a 1.40n/an/an/an/an/an/a
University of Zurich
Curated by ChEMBL
Assay Description
Inhibition of EGFR
J Med Chem 51: 1179-88 (2008)
Article DOI: 10.1021/jm070654j
BindingDB Entry DOI: 10.7270/Q29Z95RD