BDBM50027314 CHEMBL427832
SMILES: OCCN(CCO)CCCNc1c(Br)cccc1Nc1ncnc2ccncc12
InChI Key: InChIKey=BQICCMIEJPWOLO-UHFFFAOYSA-N
Data: 1 IC50
Activity Spreadsheet -- Enzyme Inhibition Constant Data from BindingDB
Found 1 hit for monomerid = 50027314
Trg + Lig
Ki
nM
ΔG°
kcal/mole
IC50
nM
Kd
nM
EC50/IC50
nM
koff
s-1
kon
M-1s-1
pHTemp
°C
Epidermal growth factor receptor
(Homo sapiens (Human))
BDBM50027314
(CHEMBL427832)
Show SMILES OCCN(CCO)CCCNc1c(Br)cccc1Nc1ncnc2ccncc12
Show InChI InChI=1S/C20H25BrN6O2/c21-16-3-1-4-18(19(16)23-6-2-8-27(9-11-28)10-12-29)26-20-15-13-22-7-5-17(15)24-14-25-20/h1,3-5,7,13-14,23,28-29H,2,6,8-12H2,(H,24,25,26)
n/an/a 1.20n/an/an/an/an/an/a
University of Zurich
Curated by ChEMBL
Assay Description
Inhibition of EGFR
J Med Chem 51: 1179-88 (2008)
Article DOI: 10.1021/jm070654j
BindingDB Entry DOI: 10.7270/Q29Z95RD