BDBM50027342 CHEMBL483105
SMILES: CCOP(C)(=O)SCCN(C(C)C)C(C)C
InChI Key: InChIKey=JJIUCEJQJXNMHV-UHFFFAOYSA-N
Data: 2 Kon
Activity Spreadsheet -- Enzyme Inhibition Constant Data from BindingDB
Found 2 hits for monomerid = 50027342
Trg + Lig
Ki
nM
ΔG°
kcal/mole
IC50
nM
Kd
nM
EC50/IC50
nM
koff
s-1
kon
M-1s-1
pHTemp
°C
Acetylcholinesterase
(Bos taurus (bovine))
BDBM50027342
(CHEMBL483105)
Show SMILES CCOP(C)(=O)SCCN(C(C)C)C(C)C
Show InChI InChI=1S/C11H26NO2PS/c1-7-14-15(6,13)16-9-8-12(10(2)3)11(4)5/h10-11H,7-9H2,1-6H3
Reactome pathway
n/an/an/an/an/an/a 1.10E+5n/an/a
Universit£ di Siena
Curated by ChEMBL
Assay Description
Inhibition of bovine AChE
J Med Chem 51: 3154-70 (2008)
Article DOI: 10.1021/jm701253t
BindingDB Entry DOI: 10.7270/Q22Z16D4
Acetylcholinesterase
(Homo sapiens (Human))
BDBM50027342
(CHEMBL483105)
Show SMILES CCOP(C)(=O)SCCN(C(C)C)C(C)C
Show InChI InChI=1S/C11H26NO2PS/c1-7-14-15(6,13)16-9-8-12(10(2)3)11(4)5/h10-11H,7-9H2,1-6H3
NCI pathway
Reactome pathway
n/an/an/an/an/an/a 2.00E+6n/an/a
Universit£ di Siena
Curated by ChEMBL
Assay Description
Inhibition of human AChE
J Med Chem 51: 3154-70 (2008)
Article DOI: 10.1021/jm701253t
BindingDB Entry DOI: 10.7270/Q22Z16D4