BDBM50027389 CHEMBL599033
SMILES: CN1CCC(CC1)C(=O)Nc1n[nH]c2c1CN(C(=O)C(C)(C)C)C2(C)C
InChI Key: InChIKey=DHJHGYYBWIWMJK-UHFFFAOYSA-N
Data: 1 IC50
Activity Spreadsheet -- Enzyme Inhibition Constant Data from BindingDB
Found 1 hit for monomerid = 50027389
Trg + Lig
Ki
nM
ΔG°
kcal/mole
IC50
nM
Kd
nM
EC50/IC50
nM
koff
s-1
kon
M-1s-1
pHTemp
°C
Cyclin-A1/Cyclin-A2/Cyclin-dependent kinase 2
(Homo sapiens (Human))
BDBM50027389
(CHEMBL599033)
Show SMILES CN1CCC(CC1)C(=O)Nc1n[nH]c2c1CN(C(=O)C(C)(C)C)C2(C)C
Show InChI InChI=1S/C19H31N5O2/c1-18(2,3)17(26)24-11-13-14(19(24,4)5)21-22-15(13)20-16(25)12-7-9-23(6)10-8-12/h12H,7-11H2,1-6H3,(H2,20,21,22,25)
Reactome pathway
n/an/a 214n/an/an/an/an/an/a
Nerviano Medical Sciences Srl
Curated by ChEMBL
Assay Description
Inhibition of human CDK2/cyclin A expressed in Escherichia coli BL21 by scintillation proximity assay
Bioorg Med Chem 18: 1844-53 (2010)
Article DOI: 10.1016/j.bmc.2010.01.042
BindingDB Entry DOI: 10.7270/Q21R6RG5