null
SMILES: CN1CCC(CC1)C(=O)N1Cc2c(NC(=O)c3ccco3)n[nH]c2C1(C)C
InChI Key: InChIKey=JKLNMYJBWWAZSO-UHFFFAOYSA-N
Activity Spreadsheet -- Enzyme Inhibition Constant Data from BindingDB
Found 1 hit for monomerid = 50027425
Trg + Lig
Ki
nM
ΔG°
kcal/mole
IC50
nM
Kd
nM
EC50/IC50
nM
koff
s-1
kon
M-1s-1
pHTemp
°C
Cyclin-A1/Cyclin-A2/Cyclin-dependent kinase 2
(Homo sapiens (Human))
BDBM50027425
(CHEMBL1744454)
Show SMILES CN1CCC(CC1)C(=O)N1Cc2c(NC(=O)c3ccco3)n[nH]c2C1(C)C
Show InChI InChI=1S/C19H25N5O3/c1-19(2)15-13(11-24(19)18(26)12-6-8-23(3)9-7-12)16(22-21-15)20-17(25)14-5-4-10-27-14/h4-5,10,12H,6-9,11H2,1-3H3,(H2,20,21,22,25)
Reactome pathway
n/an/a 33n/an/an/an/an/an/a
Nerviano Medical Sciences Srl
Curated by ChEMBL
Assay Description
Inhibition of human CDK2/cyclin A expressed in Escherichia coli BL21 by scintillation proximity assay
Bioorg Med Chem 18: 1844-53 (2010)
Article DOI: 10.1016/j.bmc.2010.01.042
BindingDB Entry DOI: 10.7270/Q21R6RG5