BDBM50027516 2-(2-Amino-3-phenyl-propionylamino)-4-methyl-pentanoic acid::CHEMBL37879
SMILES: CC(C)C[C@H](NC(=O)[C@@H](N)Cc1ccccc1)C(O)=O
InChI Key: InChIKey=RFCVXVPWSPOMFJ-STQMWFEESA-N
Data: 4 IC50
Activity Spreadsheet -- Enzyme Inhibition Constant Data from BindingDB
Found 4 hits for monomerid = 50027516
Trg + Lig
Ki
nM
ΔG°
kcal/mole
IC50
nM
Kd
nM
EC50/IC50
nM
koff
s-1
kon
M-1s-1
pHTemp
°C
Aminopeptidase N
(Homo sapiens (Human))
BDBM50027516
(2-(2-Amino-3-phenyl-propionylamino)-4-methyl-penta...)
Show SMILES CC(C)C[C@H](NC(=O)[C@@H](N)Cc1ccccc1)C(O)=O
Show InChI InChI=1S/C15H22N2O3/c1-10(2)8-13(15(19)20)17-14(18)12(16)9-11-6-4-3-5-7-11/h3-7,10,12-13H,8-9,16H2,1-2H3,(H,17,18)(H,19,20)/t12-,13-/m0/s1
NCI pathway
Reactome pathway
n/an/a 1.00E+6n/an/an/an/an/an/a
TBA
Curated by ChEMBL
Assay Description
Inhibition of Aminopeptidase M.
Bioorg Med Chem Lett 4: 1491-1496 (1994)
Article DOI: 10.1016/S0960-894X(01)80519-9
BindingDB Entry DOI: 10.7270/Q26M37B6
Angiotensin-converting enzyme
(Mus musculus)
BDBM50027516
(2-(2-Amino-3-phenyl-propionylamino)-4-methyl-penta...)
Show SMILES CC(C)C[C@H](NC(=O)[C@@H](N)Cc1ccccc1)C(O)=O
Show InChI InChI=1S/C15H22N2O3/c1-10(2)8-13(15(19)20)17-14(18)12(16)9-11-6-4-3-5-7-11/h3-7,10,12-13H,8-9,16H2,1-2H3,(H,17,18)(H,19,20)/t12-,13-/m0/s1
Reactome pathway
n/an/a 7.00E+5n/an/an/an/an/an/a
TBA
Curated by ChEMBL
Assay Description
50% Inhibitory potency against Angiotensin I converting enzyme from mouse striatum.
J Med Chem 26: 60-5 (1983)
BindingDB Entry DOI: 10.7270/Q2Q81DP6
Neprilysin
(Mus musculus)
BDBM50027516
(2-(2-Amino-3-phenyl-propionylamino)-4-methyl-penta...)
Show SMILES CC(C)C[C@H](NC(=O)[C@@H](N)Cc1ccccc1)C(O)=O
Show InChI InChI=1S/C15H22N2O3/c1-10(2)8-13(15(19)20)17-14(18)12(16)9-11-6-4-3-5-7-11/h3-7,10,12-13H,8-9,16H2,1-2H3,(H,17,18)(H,19,20)/t12-,13-/m0/s1
Reactome pathway
n/an/a 2.00E+4n/an/an/an/an/an/a
TBA
Curated by ChEMBL
Assay Description
50% Inhibitory potency against enkephalinase from mouse striatum.
J Med Chem 26: 60-5 (1983)
BindingDB Entry DOI: 10.7270/Q2Q81DP6
Aminopeptidase B
(Mus musculus)
BDBM50027516
(2-(2-Amino-3-phenyl-propionylamino)-4-methyl-penta...)
Show SMILES CC(C)C[C@H](NC(=O)[C@@H](N)Cc1ccccc1)C(O)=O
Show InChI InChI=1S/C15H22N2O3/c1-10(2)8-13(15(19)20)17-14(18)12(16)9-11-6-4-3-5-7-11/h3-7,10,12-13H,8-9,16H2,1-2H3,(H,17,18)(H,19,20)/t12-,13-/m0/s1
n/an/a 1.00E+6n/an/an/an/an/an/a
TBA
Curated by ChEMBL
Assay Description
Inhibition of Aminopeptidase B in murine L-cells by Aoyagi method.
Bioorg Med Chem Lett 4: 1491-1496 (1994)
Article DOI: 10.1016/S0960-894X(01)80519-9
BindingDB Entry DOI: 10.7270/Q26M37B6