null
SMILES: Cc1cccc(CCNC(=O)[C@H](CCCCCS)NC(=O)[C@@H]2CCCC(=O)N2)c1
InChI Key: InChIKey=QNJCPEYHBKCISJ-OALUTQOASA-N
Activity Spreadsheet -- Enzyme Inhibition Constant Data from BindingDB
Found 7 hits for monomerid = 50027597
Trg + Lig
Ki
nM
ΔG°
kcal/mole
IC50
nM
Kd
nM
EC50/IC50
nM
koff
s-1
kon
M-1s-1
pHTemp
°C
Histone deacetylase 3
(Homo sapiens (Human))
BDBM50027597
(CHEMBL3356937)
Show SMILES Cc1cccc(CCNC(=O)[C@H](CCCCCS)NC(=O)[C@@H]2CCCC(=O)N2)c1 |r|
Show InChI InChI=1S/C22H33N3O3S/c1-16-7-5-8-17(15-16)12-13-23-21(27)18(9-3-2-4-14-29)25-22(28)19-10-6-11-20(26)24-19/h5,7-8,15,18-19,29H,2-4,6,9-14H2,1H3,(H,23,27)(H,24,26)(H,25,28)/t18-,19-/m0/s1
NCI pathway
Reactome pathway
n/an/a 122n/an/an/an/an/an/a
R&D Sigma-Tau Industrie Farmaceutiche Riunite SpA
Curated by ChEMBL
Assay Description
Inhibition of HDAC3 (unknown origin) using fluorogenic tetrapeptide RHKK(Ac) substrate by fluorescence assay
J Med Chem 57: 8358-77 (2014)
Article DOI: 10.1021/jm5008209
BindingDB Entry DOI: 10.7270/Q2JW8GGN
Histone deacetylase 6
(Homo sapiens (Human))
BDBM50027597
(CHEMBL3356937)
Show SMILES Cc1cccc(CCNC(=O)[C@H](CCCCCS)NC(=O)[C@@H]2CCCC(=O)N2)c1 |r|
Show InChI InChI=1S/C22H33N3O3S/c1-16-7-5-8-17(15-16)12-13-23-21(27)18(9-3-2-4-14-29)25-22(28)19-10-6-11-20(26)24-19/h5,7-8,15,18-19,29H,2-4,6,9-14H2,1H3,(H,23,27)(H,24,26)(H,25,28)/t18-,19-/m0/s1
NCI pathway
Reactome pathway
n/an/a 15n/an/an/an/an/an/a
R&D Sigma-Tau Industrie Farmaceutiche Riunite SpA
Curated by ChEMBL
Assay Description
Inhibition of HDAC6 (unknown origin) using fluorogenic tetrapeptide RHKK(Ac) substrate by fluorescence assay
J Med Chem 57: 8358-77 (2014)
Article DOI: 10.1021/jm5008209
BindingDB Entry DOI: 10.7270/Q2JW8GGN
Histone deacetylase 1
(Homo sapiens (Human))
BDBM50027597
(CHEMBL3356937)
Show SMILES Cc1cccc(CCNC(=O)[C@H](CCCCCS)NC(=O)[C@@H]2CCCC(=O)N2)c1 |r|
Show InChI InChI=1S/C22H33N3O3S/c1-16-7-5-8-17(15-16)12-13-23-21(27)18(9-3-2-4-14-29)25-22(28)19-10-6-11-20(26)24-19/h5,7-8,15,18-19,29H,2-4,6,9-14H2,1H3,(H,23,27)(H,24,26)(H,25,28)/t18-,19-/m0/s1
NCI pathway
Reactome pathway
n/an/a 92n/an/an/an/an/an/a
R&D Sigma-Tau Industrie Farmaceutiche Riunite SpA
Curated by ChEMBL
Assay Description
Inhibition of HDAC1 (unknown origin) using fluorogenic tetrapeptide RHKK(Ac) substrate by fluorescence assay
J Med Chem 57: 8358-77 (2014)
Article DOI: 10.1021/jm5008209
BindingDB Entry DOI: 10.7270/Q2JW8GGN
Histone deacetylase 11
(Homo sapiens (Human))
BDBM50027597
(CHEMBL3356937)
Show SMILES Cc1cccc(CCNC(=O)[C@H](CCCCCS)NC(=O)[C@@H]2CCCC(=O)N2)c1 |r|
Show InChI InChI=1S/C22H33N3O3S/c1-16-7-5-8-17(15-16)12-13-23-21(27)18(9-3-2-4-14-29)25-22(28)19-10-6-11-20(26)24-19/h5,7-8,15,18-19,29H,2-4,6,9-14H2,1H3,(H,23,27)(H,24,26)(H,25,28)/t18-,19-/m0/s1
NCI pathway
Reactome pathway
n/an/a 82n/an/an/an/an/an/a
R&D Sigma-Tau Industrie Farmaceutiche Riunite SpA
Curated by ChEMBL
Assay Description
Inhibition of HDAC11 (unknown origin) using fluorogenic tetrapeptide RHKK(Ac) substrate by fluorescence assay
J Med Chem 57: 8358-77 (2014)
Article DOI: 10.1021/jm5008209
BindingDB Entry DOI: 10.7270/Q2JW8GGN
Histone deacetylase 8
(Homo sapiens (Human))
BDBM50027597
(CHEMBL3356937)
Show SMILES Cc1cccc(CCNC(=O)[C@H](CCCCCS)NC(=O)[C@@H]2CCCC(=O)N2)c1 |r|
Show InChI InChI=1S/C22H33N3O3S/c1-16-7-5-8-17(15-16)12-13-23-21(27)18(9-3-2-4-14-29)25-22(28)19-10-6-11-20(26)24-19/h5,7-8,15,18-19,29H,2-4,6,9-14H2,1H3,(H,23,27)(H,24,26)(H,25,28)/t18-,19-/m0/s1
NCI pathway
Reactome pathway
n/an/a 17n/an/an/an/an/an/a
R&D Sigma-Tau Industrie Farmaceutiche Riunite SpA
Curated by ChEMBL
Assay Description
Inhibition of HDAC8 (unknown origin) using fluorogenic tetrapeptide RHK(Ac)K(Ac) substrate by fluorescence assay
J Med Chem 57: 8358-77 (2014)
Article DOI: 10.1021/jm5008209
BindingDB Entry DOI: 10.7270/Q2JW8GGN
Polyamine deacetylase HDAC10
(Homo sapiens (Human))
BDBM50027597
(CHEMBL3356937)
Show SMILES Cc1cccc(CCNC(=O)[C@H](CCCCCS)NC(=O)[C@@H]2CCCC(=O)N2)c1 |r|
Show InChI InChI=1S/C22H33N3O3S/c1-16-7-5-8-17(15-16)12-13-23-21(27)18(9-3-2-4-14-29)25-22(28)19-10-6-11-20(26)24-19/h5,7-8,15,18-19,29H,2-4,6,9-14H2,1H3,(H,23,27)(H,24,26)(H,25,28)/t18-,19-/m0/s1
NCI pathway
Reactome pathway
n/an/a 81n/an/an/an/an/an/a
R&D Sigma-Tau Industrie Farmaceutiche Riunite SpA
Curated by ChEMBL
Assay Description
Inhibition of HDAC10 (unknown origin) using fluorogenic tetrapeptide RHKK(Ac) substrate by fluorescence assay
J Med Chem 57: 8358-77 (2014)
Article DOI: 10.1021/jm5008209
BindingDB Entry DOI: 10.7270/Q2JW8GGN
Histone deacetylase 2
(Homo sapiens (Human))
BDBM50027597
(CHEMBL3356937)
Show SMILES Cc1cccc(CCNC(=O)[C@H](CCCCCS)NC(=O)[C@@H]2CCCC(=O)N2)c1 |r|
Show InChI InChI=1S/C22H33N3O3S/c1-16-7-5-8-17(15-16)12-13-23-21(27)18(9-3-2-4-14-29)25-22(28)19-10-6-11-20(26)24-19/h5,7-8,15,18-19,29H,2-4,6,9-14H2,1H3,(H,23,27)(H,24,26)(H,25,28)/t18-,19-/m0/s1
NCI pathway
Reactome pathway
n/an/a 601n/an/an/an/an/an/a
R&D Sigma-Tau Industrie Farmaceutiche Riunite SpA
Curated by ChEMBL
Assay Description
Inhibition of HDAC2 (unknown origin) using fluorogenic tetrapeptide RHKK(Ac) substrate by fluorescence assay
J Med Chem 57: 8358-77 (2014)
Article DOI: 10.1021/jm5008209
BindingDB Entry DOI: 10.7270/Q2JW8GGN