BDBM50027800 CHEMBL1770296
SMILES: CSCC[C@H](NC(=O)OC(C)(C)C)C(=O)N[C@@H](CC(C)C)C(=O)N[C@@H](Cc1ccccc1)C(O)=O
InChI Key: InChIKey=GYBXWOPENJVQKE-UFYCRDLUSA-N
Data: 1 IC50
Activity Spreadsheet -- Enzyme Inhibition Constant Data from BindingDB
Found 1 hit for monomerid = 50027800
Trg + Lig
Ki
nM
ΔG°
kcal/mole
IC50
nM
Kd
nM
EC50/IC50
nM
koff
s-1
kon
M-1s-1
pHTemp
°C
fMet-Leu-Phe receptor
(Homo sapiens (Human))
BDBM50027800
(CHEMBL1770296)
Show SMILES CSCC[C@H](NC(=O)OC(C)(C)C)C(=O)N[C@@H](CC(C)C)C(=O)N[C@@H](Cc1ccccc1)C(O)=O |r|
Show InChI InChI=1S/C25H39N3O6S/c1-16(2)14-19(22(30)27-20(23(31)32)15-17-10-8-7-9-11-17)26-21(29)18(12-13-35-6)28-24(33)34-25(3,4)5/h7-11,16,18-20H,12-15H2,1-6H3,(H,26,29)(H,27,30)(H,28,33)(H,31,32)/t18-,19-,20-/m0/s1
Reactome pathway
n/an/a 2.51E+3n/an/an/an/an/an/a
AstraZeneca
Curated by ChEMBL
Assay Description
Antagonist activity at FPR1
Bioorg Med Chem Lett 21: 2991-7 (2011)
Article DOI: 10.1016/j.bmcl.2011.03.049
BindingDB Entry DOI: 10.7270/Q2PZ5B2D