BDBM50027900 2-{4-[(2-Amino-4-oxo-3,4-dihydro-quinazolin-6-ylmethyl)-cyanomethyl-amino]-benzoylamino}-pentanedioic acid::CHEMBL34918
SMILES: Nc1nc2ccc(CN(CC#N)c3ccc(cc3)C(=O)NC(CCC(O)=O)C(O)=O)cc2c(=O)[nH]1
InChI Key: InChIKey=DYXZEOJTRVEJOX-UHFFFAOYSA-N
Data: 1 KI  2 IC50
Activity Spreadsheet -- Enzyme Inhibition Constant Data from BindingDB
Found 3 hits for monomerid = 50027900
Trg + Lig
Ki
nM
ΔG°
kcal/mole
IC50
nM
Kd
nM
EC50/IC50
nM
koff
s-1
kon
M-1s-1
pHTemp
°C
Thymidylate synthase
(Homo sapiens (Human))
BDBM50027900
(2-{4-[(2-Amino-4-oxo-3,4-dihydro-quinazolin-6-ylme...)
Show SMILES Nc1nc2ccc(CN(CC#N)c3ccc(cc3)C(=O)NC(CCC(O)=O)C(O)=O)cc2c(=O)[nH]1
Show InChI InChI=1S/C23H22N6O6/c24-9-10-29(12-13-1-6-17-16(11-13)21(33)28-23(25)27-17)15-4-2-14(3-5-15)20(32)26-18(22(34)35)7-8-19(30)31/h1-6,11,18H,7-8,10,12H2,(H,26,32)(H,30,31)(H,34,35)(H3,25,27,28,33)
NCI pathway
Reactome pathway
7n/an/an/an/an/an/an/an/a
Pedagogical University
Curated by ChEMBL
Assay Description
Compound was tested for inhibition of human (WI-L2) thymidylate synthase
J Med Chem 32: 160-5 (1989)
BindingDB Entry DOI: 10.7270/Q2RR20FM
Dihydrofolate reductase
(Homo sapiens (Human))
BDBM50027900
(2-{4-[(2-Amino-4-oxo-3,4-dihydro-quinazolin-6-ylme...)
Show SMILES Nc1nc2ccc(CN(CC#N)c3ccc(cc3)C(=O)NC(CCC(O)=O)C(O)=O)cc2c(=O)[nH]1
Show InChI InChI=1S/C23H22N6O6/c24-9-10-29(12-13-1-6-17-16(11-13)21(33)28-23(25)27-17)15-4-2-14(3-5-15)20(32)26-18(22(34)35)7-8-19(30)31/h1-6,11,18H,7-8,10,12H2,(H,26,32)(H,30,31)(H,34,35)(H3,25,27,28,33)
NCI pathway
Reactome pathway
n/an/a 460n/an/an/an/an/an/a
TBA
Curated by ChEMBL
Assay Description
Concentration required for 50% inhibition against dihydrofolate reductase of S. faecium
J Med Chem 26: 605-7 (1983)
BindingDB Entry DOI: 10.7270/Q23X85NG
Dihydrofolate reductase
(Lactobacillus casei)
BDBM50027900
(2-{4-[(2-Amino-4-oxo-3,4-dihydro-quinazolin-6-ylme...)
Show SMILES Nc1nc2ccc(CN(CC#N)c3ccc(cc3)C(=O)NC(CCC(O)=O)C(O)=O)cc2c(=O)[nH]1
Show InChI InChI=1S/C23H22N6O6/c24-9-10-29(12-13-1-6-17-16(11-13)21(33)28-23(25)27-17)15-4-2-14(3-5-15)20(32)26-18(22(34)35)7-8-19(30)31/h1-6,11,18H,7-8,10,12H2,(H,26,32)(H,30,31)(H,34,35)(H3,25,27,28,33)
n/an/a 2.60E+3n/an/an/an/an/an/a
TBA
Curated by ChEMBL
Assay Description
Concentration required for 50% inhibition against dihydrofolate reductase of L. casei
J Med Chem 26: 605-7 (1983)
BindingDB Entry DOI: 10.7270/Q23X85NG