BDBM50027922 CHEMBL3338694
SMILES: CCCCCCCCCCCCCCCCN[C@@H](C(C)C)C(=O)N[C@@H]([C@@H](C)O)C(=O)N[C@@H](CC(C)C)C(=O)N1CCC[C@H]1C(=O)N[C@@H](CC(C)C)C(=O)N[C@@H](Cc1c[nH]c2ccccc12)C(=O)N[C@@H](C)C(=O)N[C@@H]([C@@H](C)O)C(=O)N[C@@H](Cc1ccc(O)cc1)C(=O)N[C@@H]([C@@H](C)O)C(=O)N[C@@H](Cc1ccc(O)cc1)C(N)=O
InChI Key:
Data: 1 EC50
Activity Spreadsheet -- Enzyme Inhibition Constant Data from BindingDB
Found 1 hit for monomerid = 50027922
Trg + Lig
Ki
nM
ΔG°
kcal/mole
IC50
nM
Kd
nM
EC50/IC50
nM
koff
s-1
kon
M-1s-1
pHTemp
°C
Apelin receptor
(Homo sapiens (Human))
BDBM50027922
(CHEMBL3338694)
Show SMILES CCCCCCCCCCCCCCCCN[C@@H](C(C)C)C(=O)N[C@@H]([C@@H](C)O)C(=O)N[C@@H](CC(C)C)C(=O)N1CCC[C@H]1C(=O)N[C@@H](CC(C)C)C(=O)N[C@@H](Cc1c[nH]c2ccccc12)C(=O)N[C@@H](C)C(=O)N[C@@H]([C@@H](C)O)C(=O)N[C@@H](Cc1ccc(O)cc1)C(=O)N[C@@H]([C@@H](C)O)C(=O)N[C@@H](Cc1ccc(O)cc1)C(N)=O |r|
Reactome pathway
n/an/an/an/a>3.00E+4n/an/an/an/a
Novartis Institutes for BioMedical Research
Curated by ChEMBL
Assay Description
Agonist activity at APJ receptor in HEK293 cells assessed as inhibition of forskolin-induced cAMP level incubated for 5 mins prior to forskolin chall...
Bioorg Med Chem Lett 24: 4871-5 (2014)
Article DOI: 10.1016/j.bmcl.2014.08.045
BindingDB Entry DOI: 10.7270/Q2D50PH2