BDBM50027944 CHEMBL3344425
SMILES: N[C@@H](CO)COc1c(Cl)cc(cc1Cl)-c1nc(no1)N1CCN(CC1)C(=O)C1CCCCC1
InChI Key: InChIKey=HESBVDQCDNMVTD-INIZCTEOSA-N
Data: 2 EC50
Activity Spreadsheet -- Enzyme Inhibition Constant Data from BindingDB
Found 2 hits for monomerid = 50027944
Trg + Lig
Ki
nM
ΔG°
kcal/mole
IC50
nM
Kd
nM
EC50/IC50
nM
koff
s-1
kon
M-1s-1
pHTemp
°C
Sphingosine 1-phosphate receptor 3
(Homo sapiens (Human))
BDBM50027944
(CHEMBL3344425)
Show SMILES N[C@@H](CO)COc1c(Cl)cc(cc1Cl)-c1nc(no1)N1CCN(CC1)C(=O)C1CCCCC1 |r|
Show InChI InChI=1S/C22H29Cl2N5O4/c23-17-10-15(11-18(24)19(17)32-13-16(25)12-30)20-26-22(27-33-20)29-8-6-28(7-9-29)21(31)14-4-2-1-3-5-14/h10-11,14,16,30H,1-9,12-13,25H2/t16-/m0/s1
NCI pathway
Reactome pathway
n/an/an/an/a>1.00E+4n/an/an/an/a
Boehringer Ingelheim Pharmaceuticals
Curated by ChEMBL
Assay Description
Agonist activity at human S1P3 receptor expressed in human EDG3-bla U2OS cells after 18 hrs by beta-arrestin recruitment assay
Bioorg Med Chem Lett 24: 4807-11 (2014)
Article DOI: 10.1016/j.bmcl.2014.09.003
BindingDB Entry DOI: 10.7270/Q28C9XT7
Sphingosine 1-phosphate receptor 1
(Homo sapiens (Human))
BDBM50027944
(CHEMBL3344425)
Show SMILES N[C@@H](CO)COc1c(Cl)cc(cc1Cl)-c1nc(no1)N1CCN(CC1)C(=O)C1CCCCC1 |r|
Show InChI InChI=1S/C22H29Cl2N5O4/c23-17-10-15(11-18(24)19(17)32-13-16(25)12-30)20-26-22(27-33-20)29-8-6-28(7-9-29)21(31)14-4-2-1-3-5-14/h10-11,14,16,30H,1-9,12-13,25H2/t16-/m0/s1
Reactome pathway
n/an/an/an/a>1.00E+4n/an/an/an/a
Boehringer Ingelheim Pharmaceuticals
Curated by ChEMBL
Assay Description
Agonist activity at human S1P1 receptor expressed in human EDG1-bla U2OS cells after 18 hrs by beta-arrestin recruitment assay
Bioorg Med Chem Lett 24: 4807-11 (2014)
Article DOI: 10.1016/j.bmcl.2014.09.003
BindingDB Entry DOI: 10.7270/Q28C9XT7