BDBM50027950 CHEMBL3344431
SMILES: CC1(C)CC(C1)C(=O)N1CCN(CC1)c1noc(n1)-c1cc(F)c(OC[C@H](O)CO)cc1Cl
InChI Key: InChIKey=ZKWDKZAMLVPGBD-CQSZACIVSA-N
Data: 2 EC50
Activity Spreadsheet -- Enzyme Inhibition Constant Data from BindingDB
Found 2 hits for monomerid = 50027950
Trg + Lig
Ki
nM
ΔG°
kcal/mole
IC50
nM
Kd
nM
EC50/IC50
nM
koff
s-1
kon
M-1s-1
pHTemp
°C
Sphingosine 1-phosphate receptor 3
(Homo sapiens (Human))
BDBM50027950
(CHEMBL3344431)
Show SMILES CC1(C)CC(C1)C(=O)N1CCN(CC1)c1noc(n1)-c1cc(F)c(OC[C@H](O)CO)cc1Cl |r|
Show InChI InChI=1S/C22H28ClFN4O5/c1-22(2)9-13(10-22)20(31)27-3-5-28(6-4-27)21-25-19(33-26-21)15-7-17(24)18(8-16(15)23)32-12-14(30)11-29/h7-8,13-14,29-30H,3-6,9-12H2,1-2H3/t14-/m1/s1
NCI pathway
Reactome pathway
n/an/an/an/a>1.00E+4n/an/an/an/a
Boehringer Ingelheim Pharmaceuticals
Curated by ChEMBL
Assay Description
Agonist activity at human S1P3 receptor expressed in human EDG3-bla U2OS cells after 18 hrs by beta-arrestin recruitment assay
Bioorg Med Chem Lett 24: 4807-11 (2014)
Article DOI: 10.1016/j.bmcl.2014.09.003
BindingDB Entry DOI: 10.7270/Q28C9XT7
Sphingosine 1-phosphate receptor 1
(Homo sapiens (Human))
BDBM50027950
(CHEMBL3344431)
Show SMILES CC1(C)CC(C1)C(=O)N1CCN(CC1)c1noc(n1)-c1cc(F)c(OC[C@H](O)CO)cc1Cl |r|
Show InChI InChI=1S/C22H28ClFN4O5/c1-22(2)9-13(10-22)20(31)27-3-5-28(6-4-27)21-25-19(33-26-21)15-7-17(24)18(8-16(15)23)32-12-14(30)11-29/h7-8,13-14,29-30H,3-6,9-12H2,1-2H3/t14-/m1/s1
Reactome pathway
n/an/an/an/a 1.20E+3n/an/an/an/a
Boehringer Ingelheim Pharmaceuticals
Curated by ChEMBL
Assay Description
Agonist activity at human S1P1 receptor expressed in human EDG1-bla U2OS cells after 18 hrs by beta-arrestin recruitment assay
Bioorg Med Chem Lett 24: 4807-11 (2014)
Article DOI: 10.1016/j.bmcl.2014.09.003
BindingDB Entry DOI: 10.7270/Q28C9XT7