BDBM50027954 CHEMBL3344434
SMILES: CC1(C)CC(C1)C(=O)N1CCN(CC1)c1noc(n1)-c1cc(F)c(OCCC(O)=O)cc1Cl
InChI Key: InChIKey=RYEIJLCUOKIDOP-UHFFFAOYSA-N
Data: 2 EC50
Activity Spreadsheet -- Enzyme Inhibition Constant Data from BindingDB
Found 2 hits for monomerid = 50027954
Trg + Lig
Ki
nM
ΔG°
kcal/mole
IC50
nM
Kd
nM
EC50/IC50
nM
koff
s-1
kon
M-1s-1
pHTemp
°C
Sphingosine 1-phosphate receptor 3
(Homo sapiens (Human))
BDBM50027954
(CHEMBL3344434)
Show SMILES CC1(C)CC(C1)C(=O)N1CCN(CC1)c1noc(n1)-c1cc(F)c(OCCC(O)=O)cc1Cl
Show InChI InChI=1S/C22H26ClFN4O5/c1-22(2)11-13(12-22)20(31)27-4-6-28(7-5-27)21-25-19(33-26-21)14-9-16(24)17(10-15(14)23)32-8-3-18(29)30/h9-10,13H,3-8,11-12H2,1-2H3,(H,29,30)
NCI pathway
Reactome pathway
n/an/an/an/a>1.00E+4n/an/an/an/a
Boehringer Ingelheim Pharmaceuticals
Curated by ChEMBL
Assay Description
Agonist activity at human S1P3 receptor expressed in human EDG3-bla U2OS cells after 18 hrs by beta-arrestin recruitment assay
Bioorg Med Chem Lett 24: 4807-11 (2014)
Article DOI: 10.1016/j.bmcl.2014.09.003
BindingDB Entry DOI: 10.7270/Q28C9XT7
Sphingosine 1-phosphate receptor 1
(Homo sapiens (Human))
BDBM50027954
(CHEMBL3344434)
Show SMILES CC1(C)CC(C1)C(=O)N1CCN(CC1)c1noc(n1)-c1cc(F)c(OCCC(O)=O)cc1Cl
Show InChI InChI=1S/C22H26ClFN4O5/c1-22(2)11-13(12-22)20(31)27-4-6-28(7-5-27)21-25-19(33-26-21)14-9-16(24)17(10-15(14)23)32-8-3-18(29)30/h9-10,13H,3-8,11-12H2,1-2H3,(H,29,30)
Reactome pathway
n/an/an/an/a 2.70E+3n/an/an/an/a
Boehringer Ingelheim Pharmaceuticals
Curated by ChEMBL
Assay Description
Agonist activity at human S1P1 receptor expressed in human EDG1-bla U2OS cells after 18 hrs by beta-arrestin recruitment assay
Bioorg Med Chem Lett 24: 4807-11 (2014)
Article DOI: 10.1016/j.bmcl.2014.09.003
BindingDB Entry DOI: 10.7270/Q28C9XT7