BDBM50027959 CHEMBL3360256
SMILES: CCc1ccc(cc1)S(=O)(=O)Nc1ccc(O)cc1
InChI Key: InChIKey=IERBZJSXDFMRQN-UHFFFAOYSA-N
Data: 1 IC50
Activity Spreadsheet -- Enzyme Inhibition Constant Data from BindingDB
Found 1 hit for monomerid = 50027959
Trg + Lig
Ki
nM
ΔG°
kcal/mole
IC50
nM
Kd
nM
EC50/IC50
nM
koff
s-1
kon
M-1s-1
pHTemp
°C
Cytochrome b-c1 complex subunit 7
(Homo sapiens (Human))
BDBM50027959
(CHEMBL3360256)
Show SMILES CCc1ccc(cc1)S(=O)(=O)Nc1ccc(O)cc1
Show InChI InChI=1S/C14H15NO3S/c1-2-11-3-9-14(10-4-11)19(17,18)15-12-5-7-13(16)8-6-12/h3-10,15-16H,2H2,1H3
n/an/a>2.00E+4n/an/an/an/an/an/a
Yonsei University
Curated by ChEMBL
Assay Description
Modulation of UQCRB in human HepG2 cells assessed as inhibition of HIF-1alpha for 4 hrs under 1%O2 by Western blot analysis
J Med Chem 57: 7990-8 (2014)
Article DOI: 10.1021/jm500863j
BindingDB Entry DOI: 10.7270/Q24Q7WK4