BDBM50027963 CHEMBL3360259
SMILES: Oc1ccc(NS(=O)(=O)c2ccc(cc2)-c2ccccc2)cc1
InChI Key: InChIKey=SZOPCHOOHZIDKC-UHFFFAOYSA-N
Data: 1 IC50
Activity Spreadsheet -- Enzyme Inhibition Constant Data from BindingDB
Found 1 hit for monomerid = 50027963
Trg + Lig
Ki
nM
ΔG°
kcal/mole
IC50
nM
Kd
nM
EC50/IC50
nM
koff
s-1
kon
M-1s-1
pHTemp
°C
Cytochrome b-c1 complex subunit 7
(Homo sapiens (Human))
BDBM50027963
(CHEMBL3360259)
Show SMILES Oc1ccc(NS(=O)(=O)c2ccc(cc2)-c2ccccc2)cc1
Show InChI InChI=1S/C18H15NO3S/c20-17-10-8-16(9-11-17)19-23(21,22)18-12-6-15(7-13-18)14-4-2-1-3-5-14/h1-13,19-20H
n/an/a 2.50E+3n/an/an/an/an/an/a
Yonsei University
Curated by ChEMBL
Assay Description
Modulation of UQCRB in human HepG2 cells assessed as inhibition of HIF-1alpha for 4 hrs under 1%O2 by Western blot analysis
J Med Chem 57: 7990-8 (2014)
Article DOI: 10.1021/jm500863j
BindingDB Entry DOI: 10.7270/Q24Q7WK4