BDBM50027965 CHEMBL3360261
SMILES: Oc1ccc(NS(=O)(=O)c2ccc(cc2)-c2ccccc2)cc1Cl
InChI Key: InChIKey=PAIKZAGYNQBCPL-UHFFFAOYSA-N
Data: 1 IC50
Activity Spreadsheet -- Enzyme Inhibition Constant Data from BindingDB
Found 1 hit for monomerid = 50027965
Trg + Lig
Ki
nM
ΔG°
kcal/mole
IC50
nM
Kd
nM
EC50/IC50
nM
koff
s-1
kon
M-1s-1
pHTemp
°C
Cytochrome b-c1 complex subunit 7
(Homo sapiens (Human))
BDBM50027965
(CHEMBL3360261)
Show SMILES Oc1ccc(NS(=O)(=O)c2ccc(cc2)-c2ccccc2)cc1Cl
Show InChI InChI=1S/C18H14ClNO3S/c19-17-12-15(8-11-18(17)21)20-24(22,23)16-9-6-14(7-10-16)13-4-2-1-3-5-13/h1-12,20-21H
n/an/a>2.00E+4n/an/an/an/an/an/a
Yonsei University
Curated by ChEMBL
Assay Description
Modulation of UQCRB in human HepG2 cells assessed as inhibition of HIF-1alpha for 4 hrs under 1%O2 by Western blot analysis
J Med Chem 57: 7990-8 (2014)
Article DOI: 10.1021/jm500863j
BindingDB Entry DOI: 10.7270/Q24Q7WK4