BDBM50027968 CHEMBL3360264
SMILES: Oc1cccc2c(NS(=O)(=O)c3ccc(cc3)-c3ccccc3)cccc12
InChI Key: InChIKey=VOVUNCRLXUULCK-UHFFFAOYSA-N
Data: 1 IC50
Activity Spreadsheet -- Enzyme Inhibition Constant Data from BindingDB
Found 1 hit for monomerid = 50027968
Trg + Lig
Ki
nM
ΔG°
kcal/mole
IC50
nM
Kd
nM
EC50/IC50
nM
koff
s-1
kon
M-1s-1
pHTemp
°C
Cytochrome b-c1 complex subunit 7
(Homo sapiens (Human))
BDBM50027968
(CHEMBL3360264)
Show SMILES Oc1cccc2c(NS(=O)(=O)c3ccc(cc3)-c3ccccc3)cccc12
Show InChI InChI=1S/C22H17NO3S/c24-22-11-5-8-19-20(22)9-4-10-21(19)23-27(25,26)18-14-12-17(13-15-18)16-6-2-1-3-7-16/h1-15,23-24H
n/an/a>2.00E+4n/an/an/an/an/an/a
Yonsei University
Curated by ChEMBL
Assay Description
Modulation of UQCRB in human HepG2 cells assessed as inhibition of HIF-1alpha for 4 hrs under 1%O2 by Western blot analysis
J Med Chem 57: 7990-8 (2014)
Article DOI: 10.1021/jm500863j
BindingDB Entry DOI: 10.7270/Q24Q7WK4