BDBM50028042 CHEMBL3338849
SMILES: COc1ccc(CNC(=O)c2nc(cnc2-c2ccccc2)-c2cncc(C)c2)nc1OC
InChI Key: InChIKey=VZABYWQCSHQAKX-UHFFFAOYSA-N
Data: 2 KI  2 IC50
Activity Spreadsheet -- Enzyme Inhibition Constant Data from BindingDB
Found 4 hits for monomerid = 50028042
Trg + Lig
Ki
nM
ΔG°
kcal/mole
IC50
nM
Kd
nM
EC50/IC50
nM
koff
s-1
kon
M-1s-1
pHTemp
°C
Orexin receptor type 2
(Homo sapiens (Human))
BDBM50028042
(CHEMBL3338849)
Show SMILES COc1ccc(CNC(=O)c2nc(cnc2-c2ccccc2)-c2cncc(C)c2)nc1OC
Show InChI InChI=1S/C25H23N5O3/c1-16-11-18(13-26-12-16)20-15-27-22(17-7-5-4-6-8-17)23(30-20)24(31)28-14-19-9-10-21(32-2)25(29-19)33-3/h4-13,15H,14H2,1-3H3,(H,28,31)
Reactome pathway
1.40n/an/an/an/an/an/an/an/a
Merck Research Laboratories
Curated by ChEMBL
Assay Description
Displacement of (S)-N-(2-(1H-pyrrol-1-yl)phenyl)-1-(2-([3H]-1-methyl-1H-benzo[d]imidazol-2-ylthio)acetyl)pyrrolidine-2-carboxamide from human OX2R ex...
Bioorg Med Chem Lett 24: 4884-90 (2014)
Article DOI: 10.1016/j.bmcl.2014.08.041
BindingDB Entry DOI: 10.7270/Q2GX4D4J
Orexin receptor type 1
(Homo sapiens (Human))
BDBM50028042
(CHEMBL3338849)
Show SMILES COc1ccc(CNC(=O)c2nc(cnc2-c2ccccc2)-c2cncc(C)c2)nc1OC
Show InChI InChI=1S/C25H23N5O3/c1-16-11-18(13-26-12-16)20-15-27-22(17-7-5-4-6-8-17)23(30-20)24(31)28-14-19-9-10-21(32-2)25(29-19)33-3/h4-13,15H,14H2,1-3H3,(H,28,31)
Reactome pathway
8.50E+3n/an/an/an/an/an/an/an/a
Merck Research Laboratories
Curated by ChEMBL
Assay Description
Displacement of N-cyclobutyl-5-methyl-N-(2-([3H]-1-methyl-1H-benzo[d]imidazol-2-ylthio)ethyl)-2-(2H-1,2,3-triazol-2-yl)benzamide from human OX1R I408...
Bioorg Med Chem Lett 24: 4884-90 (2014)
Article DOI: 10.1016/j.bmcl.2014.08.041
BindingDB Entry DOI: 10.7270/Q2GX4D4J
Orexin receptor type 2
(Homo sapiens (Human))
BDBM50028042
(CHEMBL3338849)
Show SMILES COc1ccc(CNC(=O)c2nc(cnc2-c2ccccc2)-c2cncc(C)c2)nc1OC
Show InChI InChI=1S/C25H23N5O3/c1-16-11-18(13-26-12-16)20-15-27-22(17-7-5-4-6-8-17)23(30-20)24(31)28-14-19-9-10-21(32-2)25(29-19)33-3/h4-13,15H,14H2,1-3H3,(H,28,31)
Reactome pathway
n/an/a 31n/an/an/an/an/an/a
Merck Research Laboratories
Curated by ChEMBL
Assay Description
Antagonist activity at human OX2R expressed in CHO cells assessed as inhibition of Ala-6,12-orexinA-induced effect after 5 mins by FLIPR assay
Bioorg Med Chem Lett 24: 4884-90 (2014)
Article DOI: 10.1016/j.bmcl.2014.08.041
BindingDB Entry DOI: 10.7270/Q2GX4D4J
Orexin receptor type 1
(Homo sapiens (Human))
BDBM50028042
(CHEMBL3338849)
Show SMILES COc1ccc(CNC(=O)c2nc(cnc2-c2ccccc2)-c2cncc(C)c2)nc1OC
Show InChI InChI=1S/C25H23N5O3/c1-16-11-18(13-26-12-16)20-15-27-22(17-7-5-4-6-8-17)23(30-20)24(31)28-14-19-9-10-21(32-2)25(29-19)33-3/h4-13,15H,14H2,1-3H3,(H,28,31)
Reactome pathway
n/an/a>2.00E+4n/an/an/an/an/an/a
Merck Research Laboratories
Curated by ChEMBL
Assay Description
Antagonist activity at human OX1R I408V mutant expressed in CHO cells assessed as inhibition of Ala-6,12-orexinA-induced effect after 5 mins by FLIPR...
Bioorg Med Chem Lett 24: 4884-90 (2014)
Article DOI: 10.1016/j.bmcl.2014.08.041
BindingDB Entry DOI: 10.7270/Q2GX4D4J