null
SMILES: OC[C@@H]1[C@@H](O)[C@H](O)[C@@H](O)CN1CCCCCOCc1ccc2ccccc2c1
InChI Key: InChIKey=RTNFUFFWGXVOPY-CIAFKFPVSA-N
Activity Spreadsheet -- Enzyme Inhibition Constant Data from BindingDB
Found 3 hits for monomerid = 50028204
Trg + Lig
Ki
nM
ΔG°
kcal/mole
IC50
nM
Kd
nM
EC50/IC50
nM
koff
s-1
kon
M-1s-1
pHTemp
°C
Ceramide glucosyltransferase
(Homo sapiens (Human))
BDBM50028204
(CHEMBL3354022)
Show SMILES OC[C@@H]1[C@@H](O)[C@H](O)[C@@H](O)CN1CCCCCOCc1ccc2ccccc2c1 |r|
Show InChI InChI=1S/C22H31NO5/c24-14-19-21(26)22(27)20(25)13-23(19)10-4-1-5-11-28-15-16-8-9-17-6-2-3-7-18(17)12-16/h2-3,6-9,12,19-22,24-27H,1,4-5,10-11,13-15H2/t19-,20+,21-,22-/m1/s1
NCI pathway
Reactome pathway
n/an/a 3n/an/an/an/an/an/a
Leiden University
Curated by ChEMBL
Assay Description
Inhibition of glucosylceramide synthase (unknown origin) assessed as catabolism of NBD-glucosylceramide
J Med Chem 57: 9096-104 (2014)
Article DOI: 10.1021/jm501181z
BindingDB Entry DOI: 10.7270/Q20003PT
Non-lysosomal glucosylceramidase
(Homo sapiens (Human))
BDBM50028204
(CHEMBL3354022)
Show SMILES OC[C@@H]1[C@@H](O)[C@H](O)[C@@H](O)CN1CCCCCOCc1ccc2ccccc2c1 |r|
Show InChI InChI=1S/C22H31NO5/c24-14-19-21(26)22(27)20(25)13-23(19)10-4-1-5-11-28-15-16-8-9-17-6-2-3-7-18(17)12-16/h2-3,6-9,12,19-22,24-27H,1,4-5,10-11,13-15H2/t19-,20+,21-,22-/m1/s1
Reactome pathway
n/an/a 1n/an/an/an/an/an/a
Leiden University
Curated by ChEMBL
Assay Description
Inhibition of GBA2 (unknown origin)
J Med Chem 57: 9096-104 (2014)
Article DOI: 10.1021/jm501181z
BindingDB Entry DOI: 10.7270/Q20003PT
Lysosomal acid glucosylceramidase
(Homo sapiens (Human))
BDBM50028204
(CHEMBL3354022)
Show SMILES OC[C@@H]1[C@@H](O)[C@H](O)[C@@H](O)CN1CCCCCOCc1ccc2ccccc2c1 |r|
Show InChI InChI=1S/C22H31NO5/c24-14-19-21(26)22(27)20(25)13-23(19)10-4-1-5-11-28-15-16-8-9-17-6-2-3-7-18(17)12-16/h2-3,6-9,12,19-22,24-27H,1,4-5,10-11,13-15H2/t19-,20+,21-,22-/m1/s1
Reactome pathway
n/an/a 1.00E+3n/an/an/an/an/an/a
Leiden University
Curated by ChEMBL
Assay Description
Inhibition of GBA1 (unknown origin) using beta-D-[1-14C]glucocerebroside assessed as 4-methylumbelliferrone by fluorimetry
J Med Chem 57: 9096-104 (2014)
Article DOI: 10.1021/jm501181z
BindingDB Entry DOI: 10.7270/Q20003PT