BDBM50028243 CHEMBL3354062
SMILES: OC[C@@H]1[C@@H](O)[C@H](O)[C@@H](O)CN1CCCCCOCc1ccccc1-c1ccccc1
InChI Key: InChIKey=MDUCWMYLNVPTNV-UEQSERJNSA-N
Data: 6 IC50
Activity Spreadsheet -- Enzyme Inhibition Constant Data from BindingDB
Found 6 hits for monomerid = 50028243
Trg + Lig
Ki
nM
ΔG°
kcal/mole
IC50
nM
Kd
nM
EC50/IC50
nM
koff
s-1
kon
M-1s-1
pHTemp
°C
Ceramide glucosyltransferase
(Homo sapiens (Human))
BDBM50028243
(CHEMBL3354062)
Show SMILES OC[C@@H]1[C@@H](O)[C@H](O)[C@@H](O)CN1CCCCCOCc1ccccc1-c1ccccc1 |r|
Show InChI InChI=1S/C24H33NO5/c26-16-21-23(28)24(29)22(27)15-25(21)13-7-2-8-14-30-17-19-11-5-6-12-20(19)18-9-3-1-4-10-18/h1,3-6,9-12,21-24,26-29H,2,7-8,13-17H2/t21-,22+,23-,24-/m1/s1
NCI pathway
Reactome pathway
n/an/a 50n/an/an/an/an/an/a
Leiden University
Curated by ChEMBL
Assay Description
Inhibition of glucosylceramide synthase (unknown origin) assessed as catabolism of NBD-glucosylceramide
J Med Chem 57: 9096-104 (2014)
Article DOI: 10.1021/jm501181z
BindingDB Entry DOI: 10.7270/Q20003PT
Lysosomal acid glucosylceramidase
(Homo sapiens (Human))
BDBM50028243
(CHEMBL3354062)
Show SMILES OC[C@@H]1[C@@H](O)[C@H](O)[C@@H](O)CN1CCCCCOCc1ccccc1-c1ccccc1 |r|
Show InChI InChI=1S/C24H33NO5/c26-16-21-23(28)24(29)22(27)15-25(21)13-7-2-8-14-30-17-19-11-5-6-12-20(19)18-9-3-1-4-10-18/h1,3-6,9-12,21-24,26-29H,2,7-8,13-17H2/t21-,22+,23-,24-/m1/s1
Reactome pathway
n/an/a 1.25E+3n/an/an/an/an/an/a
Leiden University
Curated by ChEMBL
Assay Description
Inhibition of GBA1 (unknown origin) using beta-D-[1-14C]glucocerebroside assessed as 4-methylumbelliferrone by fluorimetry
J Med Chem 57: 9096-104 (2014)
Article DOI: 10.1021/jm501181z
BindingDB Entry DOI: 10.7270/Q20003PT
Maltase-glucoamylase
(Homo sapiens (Human))
BDBM50028243
(CHEMBL3354062)
Show SMILES OC[C@@H]1[C@@H](O)[C@H](O)[C@@H](O)CN1CCCCCOCc1ccccc1-c1ccccc1 |r|
Show InChI InChI=1S/C24H33NO5/c26-16-21-23(28)24(29)22(27)15-25(21)13-7-2-8-14-30-17-19-11-5-6-12-20(19)18-9-3-1-4-10-18/h1,3-6,9-12,21-24,26-29H,2,7-8,13-17H2/t21-,22+,23-,24-/m1/s1
n/an/a 1.50E+3n/an/an/an/an/an/a
Leiden University
Curated by ChEMBL
Assay Description
Inhibition of intestinal maltase (unknown origin)
J Med Chem 57: 9096-104 (2014)
Article DOI: 10.1021/jm501181z
BindingDB Entry DOI: 10.7270/Q20003PT
Sucrase-isomaltase
(Homo sapiens (Human))
BDBM50028243
(CHEMBL3354062)
Show SMILES OC[C@@H]1[C@@H](O)[C@H](O)[C@@H](O)CN1CCCCCOCc1ccccc1-c1ccccc1 |r|
Show InChI InChI=1S/C24H33NO5/c26-16-21-23(28)24(29)22(27)15-25(21)13-7-2-8-14-30-17-19-11-5-6-12-20(19)18-9-3-1-4-10-18/h1,3-6,9-12,21-24,26-29H,2,7-8,13-17H2/t21-,22+,23-,24-/m1/s1
Reactome pathway
n/an/a 200n/an/an/an/an/an/a
Leiden University
Curated by ChEMBL
Assay Description
Inhibition of intestinal sucrase (unknown origin)
J Med Chem 57: 9096-104 (2014)
Article DOI: 10.1021/jm501181z
BindingDB Entry DOI: 10.7270/Q20003PT
Lactase-phlorizin hydrolase
(Homo sapiens (Human))
BDBM50028243
(CHEMBL3354062)
Show SMILES OC[C@@H]1[C@@H](O)[C@H](O)[C@@H](O)CN1CCCCCOCc1ccccc1-c1ccccc1 |r|
Show InChI InChI=1S/C24H33NO5/c26-16-21-23(28)24(29)22(27)15-25(21)13-7-2-8-14-30-17-19-11-5-6-12-20(19)18-9-3-1-4-10-18/h1,3-6,9-12,21-24,26-29H,2,7-8,13-17H2/t21-,22+,23-,24-/m1/s1
n/an/a 1.70E+4n/an/an/an/an/an/a
Leiden University
Curated by ChEMBL
Assay Description
Inhibition of intestinal lactase (unknown origin)
J Med Chem 57: 9096-104 (2014)
Article DOI: 10.1021/jm501181z
BindingDB Entry DOI: 10.7270/Q20003PT
Beta-glucosidase
(Homo sapiens (Human))
BDBM50028243
(CHEMBL3354062)
Show SMILES OC[C@@H]1[C@@H](O)[C@H](O)[C@@H](O)CN1CCCCCOCc1ccccc1-c1ccccc1 |r|
Show InChI InChI=1S/C24H33NO5/c26-16-21-23(28)24(29)22(27)15-25(21)13-7-2-8-14-30-17-19-11-5-6-12-20(19)18-9-3-1-4-10-18/h1,3-6,9-12,21-24,26-29H,2,7-8,13-17H2/t21-,22+,23-,24-/m1/s1
Reactome pathway
n/an/a 3n/an/an/an/an/an/a
Leiden University
Curated by ChEMBL
Assay Description
Inhibition of GBA2 (unknown origin)
J Med Chem 57: 9096-104 (2014)
Article DOI: 10.1021/jm501181z
BindingDB Entry DOI: 10.7270/Q20003PT