BDBM50028685 CHEMBL3356536
SMILES: Oc1cccc2C(=O)C(NCCNc3c4CCCCc4nc4cc(Cl)ccc34)=CC(=O)c12
InChI Key: InChIKey=QOYHHKMVCBONOU-UHFFFAOYSA-N
Data: 4 IC50
PDB links: 1 PDB ID matches this monomer.
Activity Spreadsheet -- Enzyme Inhibition Constant Data from BindingDB
Found 4 hits for monomerid = 50028685
Trg + Lig
Ki
nM
ΔG°
kcal/mole
IC50
nM
Kd
nM
EC50/IC50
nM
koff
s-1
kon
M-1s-1
pHTemp
°C
Acetylcholinesterase
(Homo sapiens (Human))
BDBM50028685
(CHEMBL3356536)
Show SMILES Oc1cccc2C(=O)C(NCCNc3c4CCCCc4nc4cc(Cl)ccc34)=CC(=O)c12 |c:30|
Show InChI InChI=1S/C25H22ClN3O3/c26-14-8-9-16-19(12-14)29-18-6-2-1-4-15(18)24(16)28-11-10-27-20-13-22(31)23-17(25(20)32)5-3-7-21(23)30/h3,5,7-9,12-13,27,30H,1-2,4,6,10-11H2,(H,28,29)
NCI pathway
Reactome pathway
n/an/a 0.720n/an/an/an/an/an/a
Alma Mater Studiorum-University of Bologna
Curated by ChEMBL
Assay Description
Inhibition of human recombinant AChE after 5 mins by Ellman method
J Med Chem 57: 8576-89 (2014)
Article DOI: 10.1021/jm5010804
BindingDB Entry DOI: 10.7270/Q25H7HVD
Cholinesterase
(Homo sapiens (Human))
BDBM50028685
(CHEMBL3356536)
Show SMILES Oc1cccc2C(=O)C(NCCNc3c4CCCCc4nc4cc(Cl)ccc34)=CC(=O)c12 |c:30|
Show InChI InChI=1S/C25H22ClN3O3/c26-14-8-9-16-19(12-14)29-18-6-2-1-4-15(18)24(16)28-11-10-27-20-13-22(31)23-17(25(20)32)5-3-7-21(23)30/h3,5,7-9,12-13,27,30H,1-2,4,6,10-11H2,(H,28,29)
Reactome pathway
n/an/a 540n/an/an/an/an/an/a
University of Hradec Kralove
Curated by ChEMBL
Assay Description
Inhibition of human recombinant BChE using butyrylthiocholine iodide as substrate preincubated for 5 mins followed by substrate addition and measured...
Eur J Med Chem 168: 491-514 (2019)
Article DOI: 10.1016/j.ejmech.2019.02.021
Acetylcholinesterase
(Homo sapiens (Human))
BDBM50028685
(CHEMBL3356536)
Show SMILES Oc1cccc2C(=O)C(NCCNc3c4CCCCc4nc4cc(Cl)ccc34)=CC(=O)c12 |c:30|
Show InChI InChI=1S/C25H22ClN3O3/c26-14-8-9-16-19(12-14)29-18-6-2-1-4-15(18)24(16)28-11-10-27-20-13-22(31)23-17(25(20)32)5-3-7-21(23)30/h3,5,7-9,12-13,27,30H,1-2,4,6,10-11H2,(H,28,29)
NCI pathway
Reactome pathway
n/an/a 0.720n/an/an/an/an/an/a
University of Hradec Kralove
Curated by ChEMBL
Assay Description
Inhibition of human recombinant AChE using acetylthiocholine iodide as substrate preincubated for 5 mins followed by substrate addition and measured ...
Eur J Med Chem 168: 491-514 (2019)
Article DOI: 10.1016/j.ejmech.2019.02.021
Cholinesterase
(Homo sapiens (Human))
BDBM50028685
(CHEMBL3356536)
Show SMILES Oc1cccc2C(=O)C(NCCNc3c4CCCCc4nc4cc(Cl)ccc34)=CC(=O)c12 |c:30|
Show InChI InChI=1S/C25H22ClN3O3/c26-14-8-9-16-19(12-14)29-18-6-2-1-4-15(18)24(16)28-11-10-27-20-13-22(31)23-17(25(20)32)5-3-7-21(23)30/h3,5,7-9,12-13,27,30H,1-2,4,6,10-11H2,(H,28,29)
Reactome pathway
n/an/a 542n/an/an/an/an/an/a
Alma Mater Studiorum-University of Bologna
Curated by ChEMBL
Assay Description
Inhibition of human plasmatic BChE after 5 mins by Ellman method
J Med Chem 57: 8576-89 (2014)
Article DOI: 10.1021/jm5010804
BindingDB Entry DOI: 10.7270/Q25H7HVD